{"text_format":"1","workbook":"xlsx","n_sheets":13,"sheets":["Instructions","NB-WB Left","SB-EB Left","EB-NB Left","WB-SB Left","N-S","N-S Omit RT","N-S Formatted","E-W","E-W Omit RT","E-W Formatted","Calcs","Lists"],"not_rendered":{"charts":0,"images":0,"macros":1,"external_links":0,"defined_names":0,"comments":0,"pivot_tables":0},"unopened":[],"bounds":{"document_bytes":16777216,"sheet_cells":100000,"rows_first":2000,"rows_last":500,"rows_between":2000,"halvings":0,"cell_chars":16384,"cell_head_chars":4096},"cells_cut":0,"cells_raw":0,"read":"whole","date_system":"1900"}

{"sheet":"Instructions","index":0,"n_rows":33,"n_cols":2,"rows_kept":33,"cut":false,"hidden":false,"merged":[[9,0,9,6],[29,0,29,6],[30,1,30,6],[27,0,28,0],[17,1,17,6],[18,1,18,6],[19,1,19,6],[16,1,16,6],[23,1,23,6],[25,1,25,6],[26,1,26,6],[20,1,20,6],[12,1,12,6],[31,1,31,6],[32,0,33,0],[32,1,33,6],[24,1,24,6],[27,1,28,6],[0,0,0,6],[1,0,1,6],[15,0,15,6],[21,1,22,6],[21,0,22,0],[14,1,14,6],[4,1,4,6],[5,1,5,6],[3,1,3,6],[10,1,10,6],[11,1,11,6],[13,1,13,6],[2,1,2,6],[7,1,7,6],[6,1,6,6],[8,1,8,6]]}
["Worksheet Instructions:"]
["Entering Volume Information:"]
["Step 1","Determine which approaches need to be studied (N-S, E-W, or both)."]
["Step 2","For each roadway, determine whether opposing right-turning traffic should be omitted or not                                                                                   (whether the right-turning traffic is yield-controlled or not)."]
["Step 3","Open an \"Excel Full 4-leg\" download of a Miovision Count and go to the \"Total\" sheet."]
["Step 4","Copy the volume info starting in cell A12 and paste it into cell A12 of the appropriate sheet(s) of this file                                                              (N-S, E-W, N-S Omit RT, E-W Omit RT, or any combination thereof)*"]
[null,"*Note that if the Miovision count did not start on the hour (e.g. 6 AM, 11 AM, 4 PM), you will have to manually adjust the formulas for the hour that wraps around."]
["Step 5","Hit the macro button on the appropriate sheet (regular or Omit RT) for each direction that you're studying.                                                     This will send the data to the corresponding Formatted sheet."]
["Step 6","On the Formatted sheet, hit the appropriate macro button for each approach that you're studying to send the formatted data to the corresponding approach sheet."]
["Approach Sheet Instructions:"]
["Step 1","Fill out the gray boxes to describe the location and approach."]
["Step 2","Select logical TOD plans based on the coloration (and the TOD plans of adjacent signals).**"]
[null,"**Based on the selections in the light orange boxes to the right, the Start and End of the Recommended TOD Plan Intervals will auto-populate (you will have to manually correct some of the intervals if the AM plan doesn't start at 6 AM)."]
["Step 3","Fill out the yellow boxes to auto-populate the white boxes."]
["Step 4","Fill out the light orange boxes based on engineering judgment."]
["Engineering Judgment Notes:"]
["A)","If the existing phasing is Perm Only, the TIE Manual criteria should primarily be considered rather than the category risk levels."]
["i)","Perm Only phasing should be used unless at least one TIE Manual criterion is met."]
["ii)","Prot-Perm phasing should be used if the volume or delay TIE Manual criterion met (but not the crashes criterion)."]
["iii)","Prot Only phasing should be used if the crashes TIE Manual criterion is met."]
["B)","If the existing phasing is Prot-Perm, it may be prudent to use more liberal guidelines than those prescribed in OM 15-04. "]
["C)","An Elevated or Normal risk level in a Dark Orange category should carry more weight than such a risk level in a Peach category, which should carry more weight than such a risk level in a Green category."]
[]
["i)","If just one Dark Orange category has an Elevated risk level, the FYA phasing should be Prot Only."]
["ii)","If more than one Green category has an Elevated risk level, the FYA phasing should not necessarily be Prot Only."]
["D)","The Left Turn Crashes criterion is somewhat meaningless if the existing phasing is Prot Only (esp. a Normal or Low Risk value)."]
["i)","If the existing phasing is Prot-Perm or Perm Only, a Left Turn Crashes risk level of Normal should be somewhat of a red flag."]
["ii)","If the existing phasing is Prot-Perm or Perm Only, a Left Turn Crashes risk level of Low should lower the weight placed on risk levels of Normal or Elevated in other categories."]
[]
["Calcs Sheet Instructions:"]
["A)","The box in the upper left helps quickly convert a measured sight distance value into a travel time (for a given speed limit)."]
["i)","Fill out the yellow boxes to auto-populate the orange box."]
["B)","The cross product cells can be pasted below the Left/U-Turn and Opp. Thru/Right columns on any row that is between two rows of volume data (to help you quickly assess the TIE Manual volume criterion if necessary)."]

{"sheet":"NB-WB Left","index":1,"n_rows":54,"n_cols":20,"rows_kept":54,"cut":false,"hidden":false,"merged":[[62,6,62,10],[47,4,47,5],[47,6,47,7],[47,8,47,9],[47,10,47,11],[48,0,48,1],[49,0,49,1],[49,2,49,3],[49,4,49,5],[49,6,49,7],[49,8,49,9],[49,10,49,11],[54,0,55,5],[62,13,62,14],[27,2,30,2],[42,2,42,3],[42,4,42,5],[46,0,46,1],[19,0,26,0],[27,0,33,0],[19,4,22,4],[46,2,46,3],[46,4,46,5],[34,0,41,0],[38,2,41,2],[19,2,22,2],[23,2,26,2],[31,2,33,2],[23,5,26,5],[31,4,33,4],[31,5,33,5],[31,6,33,6],[31,7,33,7],[23,6,26,6],[47,0,47,1],[47,2,47,3],[19,5,22,5],[19,6,22,6],[23,7,26,7],[23,4,26,4],[19,7,22,7],[31,3,33,3],[27,4,30,4],[27,5,30,5],[23,3,26,3],[19,3,22,3],[27,3,30,3],[4,0,18,0],[9,2,13,2],[9,3,13,3],[9,4,13,4],[9,5,13,5],[14,2,18,2],[14,3,18,3],[2,3,2,4],[4,6,8,6],[14,6,18,6],[9,6,13,6],[14,5,18,5],[4,3,8,3],[1,1,1,2],[1,3,1,4],[4,2,8,2],[14,4,18,4],[2,1,2,2],[2,5,2,6],[1,7,1,8],[4,4,8,4],[4,5,8,5],[4,7,8,7],[14,7,18,7],[1,5,1,6],[9,7,13,7],[2,7,2,8],[4,8,8,8],[14,11,18,11],[19,10,22,10],[4,10,8,10],[14,9,18,9],[19,8,22,8],[19,9,22,9],[31,9,33,9],[4,9,8,9],[9,8,13,8],[9,9,13,9],[19,11,22,11],[23,10,26,10],[23,11,26,11],[14,10,18,10],[23,8,26,8],[23,9,26,9],[31,8,33,8],[44,6,44,7],[27,6,30,6],[27,7,30,7],[34,7,37,7],[38,7,41,7],[38,6,41,6],[34,6,37,6],[43,10,43,11],[34,8,37,8],[43,8,43,9],[44,8,44,9],[44,10,44,11],[34,10,37,10],[3,14,3,19],[1,9,1,11],[2,9,2,11],[4,11,8,11],[9,10,13,10],[9,11,13,11],[48,10,48,11],[45,10,45,11],[46,10,46,11],[42,8,42,9],[14,8,18,8],[34,9,37,9],[27,11,30,11],[31,10,33,10],[31,11,33,11],[27,10,30,10],[27,8,30,8],[27,9,30,9],[34,11,37,11],[38,10,41,10],[38,11,41,11],[42,10,42,11],[38,8,41,8],[38,9,41,9],[0,0,0,11],[48,2,48,3],[48,4,48,5],[48,6,48,7],[48,8,48,9],[34,2,37,2],[45,4,45,5],[42,6,42,7],[34,4,37,4],[34,5,37,5],[38,3,41,3],[38,4,41,4],[34,3,37,3],[38,5,41,5],[46,8,46,9],[43,2,43,3],[44,2,44,3],[45,2,45,3],[43,4,43,5],[44,4,44,5],[45,6,45,7],[45,8,45,9],[46,6,46,7],[43,6,43,7]]}
["Modified Left-Turn Signal Display Worksheet"]
["Intersection:",null,null,"Crash Dates:",null,null,null,"Analysis Date:"]
["Approach:","NB-WB Left",null,"Traffic Count Date:",null,null,null,"Analyst:"]
["Factors","Parameter","AM Value","Risk Level","Mid-Day Value","Risk Level","PM Value","Risk Level","Evening Value","Risk Level","Nighttime Value","Risk Level",null,null,"Hourly Totals"]
["Sight Distance","Sight Distance (e.g. horizontal or ",null,{"$f":"IF(ISBLANK(C5),\"\",IF(C5>=5.5,\"Low\",IF(C5<=0,\"Error\",\"Elevated\")))","v":""},{"$f":"IF(ISBLANK($C5),\"\",$C5)","v":""},{"$f":"IF(ISBLANK($D5),\"\",$D5)","v":""},{"$f":"IF(ISBLANK($C5),\"\",$C5)","v":""},{"$f":"IF(ISBLANK($D5),\"\",$D5)","v":""},{"$f":"IF(ISBLANK($C5),\"\",$C5)","v":""},{"$f":"IF(ISBLANK($D5),\"\",$D5)","v":""},{"$f":"IF(ISBLANK($C5),\"\",$C5)","v":""},{"$f":"IF(ISBLANK($D5),\"\",$D5)","v":""},null,null,"NB Left/U-turn","SB Thru/Right","SB Left/U-turn","NB Thru/Right","Start of Hour","Ideal TOD Plan"]
[null,"vertical curve or intersection skew)"]
[null,"≥ 5.5 sec of travel time = Low"]
[null,"< 5.5 sec of travel time = Elevated"]
[null,"   [example: for 50 mph, 5.5 sec ≈ 400 ft]"]
[null,"Left-Turn Offset*",null,{"$f":"IF(ISBLANK(C10),\"\",IF(C10>=0,\"Low\",IF(C10<-6,\"Elevated\",\"Normal\")))","v":""},{"$f":"IF(ISBLANK($C10),\"\",$C10)","v":""},{"$f":"IF(ISBLANK($D10),\"\",$D10)","v":""},{"$f":"IF(ISBLANK($C10),\"\",$C10)","v":""},{"$f":"IF(ISBLANK($D10),\"\",$D10)","v":""},{"$f":"IF(ISBLANK($C10),\"\",$C10)","v":""},{"$f":"IF(ISBLANK($D10),\"\",$D10)","v":""},{"$f":"IF(ISBLANK($C10),\"\",$C10)","v":""},{"$f":"IF(ISBLANK($D10),\"\",$D10)","v":""}]
[null,"≥ 0 ft = Low"]
[null,"0 < x ≤ -6 ft = Normal"]
[null,"< - 6 ft = Elevated"]
[null,"*See FHWA Publication: FHWA-HRT-09-036"]
[null,"Opposing Left-Turn / U-turn Use**","See Table to Right (worst hour)",null,{"$f":"IF(ISBLANK($C15),\"\",$C15)","v":"See Table to Right (worst hour)"},null,{"$f":"IF(ISBLANK($C15),\"\",$C15)","v":"See Table to Right (worst hour)"},null,{"$f":"IF(ISBLANK($C15),\"\",$C15)","v":"See Table to Right (worst hour)"},null,{"$f":"IF(ISBLANK($C15),\"\",$C15)","v":"See Table to Right (worst hour)"}]
[null,"< 30 vph = Low"]
[null,"30 ≤ x < 60 vph = Normal"]
[null,"≥ 60 vph = Elevated"]
[null,"**Not Applicable if Left-Turn Offset > 0"]
["Traffic Volume","Opposing Thru / Right Volume","See Table to Right (worst hour)",null,"See Table to Right (worst hour)",null,"See Table to Right (worst hour)",null,"See Table to Right (worst hour)",null,"See Table to Right (worst hour)"]
[null,"< 400 vph = Low"]
[null,"400 ≤ x < 800 vph = Normal"]
[null,"≥ 800 vph = Elevated"]
[null,"Left-Turn / U-turn Volume","See Table to Right (worst hour)",null,"See Table to Right (worst hour)",null,"See Table to Right (worst hour)",null,"See Table to Right (worst hour)",null,"See Table to Right (worst hour)"]
[null,"< 60 vph = Low"]
[null,"60 ≤ x < 120 vph = Normal"]
[null,"≥ 120 vph = Elevated"]
["Number of Lanes","Opposing Thru Lanes",null,{"$f":"IF(ISBLANK(C28),\"\",IF(C28=1,\"Low\",IF(C28>=3,\"Elevated\",IF(C28<=0,\"Error\",\"Normal\"))))","v":""},{"$f":"IF(ISBLANK($C28),\"\",$C28)","v":""},{"$f":"IF(ISBLANK($D28),\"\",$D28)","v":""},{"$f":"IF(ISBLANK($C28),\"\",$C28)","v":""},{"$f":"IF(ISBLANK($D28),\"\",$D28)","v":""},{"$f":"IF(ISBLANK($C28),\"\",$C28)","v":""},{"$f":"IF(ISBLANK($D28),\"\",$D28)","v":""},{"$f":"IF(ISBLANK($C28),\"\",$C28)","v":""},{"$f":"IF(ISBLANK($D28),\"\",$D28)","v":""}]
[null,"1 = Low"]
[null,"2 = Normal"]
[null,"≥ 3 = Elevated"]
[null,"Left-Turn Lanes",null,{"$f":"IF(ISBLANK(C32),\"\",IF(C32=1,\"Low\",IF(C32>=2,\"Elevated\",\"Error\")))","v":""},{"$f":"IF(ISBLANK($C32),\"\",$C32)","v":""},{"$f":"IF(ISBLANK($D32),\"\",$D32)","v":""},{"$f":"IF(ISBLANK($C32),\"\",$C32)","v":""},{"$f":"IF(ISBLANK($D32),\"\",$D32)","v":""},{"$f":"IF(ISBLANK($C32),\"\",$C32)","v":""},{"$f":"IF(ISBLANK($D32),\"\",$D32)","v":""},{"$f":"IF(ISBLANK($C32),\"\",$C32)","v":""},{"$f":"IF(ISBLANK($D32),\"\",$D32)","v":""}]
[null,"1 = Low"]
[null,"≥2 = Elevated"]
["Other","Opposing Speed Limit",null,{"$f":"IF(ISBLANK(C35),\"\",IF(C35<45,IF(C35<5,\"Error\",\"Low\"),IF(C35>50,\"Elevated\",\"Normal\")))","v":""},{"$f":"IF(ISBLANK($C35),\"\",$C35)","v":""},{"$f":"IF(ISBLANK($D35),\"\",$D35)","v":""},{"$f":"IF(ISBLANK($C35),\"\",$C35)","v":""},{"$f":"IF(ISBLANK($D35),\"\",$D35)","v":""},{"$f":"IF(ISBLANK($C35),\"\",$C35)","v":""},{"$f":"IF(ISBLANK($D35),\"\",$D35)","v":""},{"$f":"IF(ISBLANK($C35),\"\",$C35)","v":""},{"$f":"IF(ISBLANK($D35),\"\",$D35)","v":""}]
[null,"< 45 = Low"]
[null,"45 ≤ x ≤ 50 = Normal"]
[null,"> 50 = Elevated"]
[null,"Left Turn Crashes (12-month average)",null,{"$f":"IF(ISBLANK(C39),\"\",IF(C39<4,IF(C39<0,\"Error\",\"Low\"),IF(C39>=6,\"Elevated\",\"Normal\")))","v":""},{"$f":"IF(ISBLANK($C39),\"\",$C39)","v":""},{"$f":"IF(ISBLANK($D39),\"\",$D39)","v":""},{"$f":"IF(ISBLANK($C39),\"\",$C39)","v":""},{"$f":"IF(ISBLANK($D39),\"\",$D39)","v":""},{"$f":"IF(ISBLANK($C39),\"\",$C39)","v":""},{"$f":"IF(ISBLANK($D39),\"\",$D39)","v":""},{"$f":"IF(ISBLANK($C39),\"\",$C39)","v":""},{"$f":"IF(ISBLANK($D39),\"\",$D39)","v":""}]
[null,"< 4 crashes = Low"]
[null,"4 ≤ x < 6 crashes = Normal"]
[null,"≥ 6 crashes = Elevated"]
[null,null,"AM",null,"Mid-Day",null,"PM",null,"Evening",null,"Free"]
[null,"Number of Low Risk:",{"$f":"COUNTIF(D$5:D$42,\"Low\")","v":0},null,{"$f":"COUNTIF(F$5:F$42,\"Low\")","v":0},null,{"$f":"COUNTIF(H$5:H$42,\"Low\")","v":0},null,{"$f":"COUNTIF(J$5:J$42,\"Low\")","v":0},null,{"$f":"COUNTIF(L$5:L$42,\"Low\")","v":0}]
[null,"Number of Normal Risk:",{"$f":"COUNTIF(D$5:D$42,\"Normal\")","v":0},null,{"$f":"COUNTIF(F$5:F$42,\"Normal\")","v":0},null,{"$f":"COUNTIF(H$5:H$42,\"Normal\")","v":0},null,{"$f":"COUNTIF(J$5:J$42,\"Normal\")","v":0},null,{"$f":"COUNTIF(L$5:L$42,\"Normal\")","v":0}]
[null,"Number of Elevated Risk:",{"$f":"COUNTIF(D$5:D$42,\"Elevated\")","v":0},null,{"$f":"COUNTIF(F$5:F$42,\"Elevated\")","v":0},null,{"$f":"COUNTIF(H$5:H$42,\"Elevated\")","v":0},null,{"$f":"COUNTIF(J$5:J$42,\"Elevated\")","v":0},null,{"$f":"COUNTIF(L$5:L$42,\"Elevated\")","v":0}]
["Memo Recommended Left-Turn Display:",null,{"$f":"IF(C46>=2,\"Protected Only\",IF(AND(C45<=1,C46=0),\"Permissive Only\",\"Prot-Perm\"))","v":"Permissive Only"},null,{"$f":"IF(E46>=2,\"Protected Only\",IF(AND(E45<=1,E46=0),\"Permissive Only\",\"Prot-Perm\"))","v":"Permissive Only"},null,{"$f":"IF(G46>=2,\"Protected Only\",IF(AND(G45<=1,G46=0),\"Permissive Only\",\"Prot-Perm\"))","v":"Permissive Only"},null,{"$f":"IF(I46>=2,\"Protected Only\",IF(AND(I45<=1,I46=0),\"Permissive Only\",\"Prot-Perm\"))","v":"Permissive Only"},null,{"$f":"IF(K46>=2,\"Protected Only\",IF(AND(K45<=1,K46=0),\"Permissive Only\",\"Prot-Perm\"))","v":"Permissive Only"}]
["Start of Recommended TOD Plan Interval:",null,{"$f":"INDIRECT(\"S\"&MATCH(C43,$T$6:$T$52,0)+5)","v":{"$error":"#N/A"}},null,{"$f":"INDIRECT(\"S\"&MATCH(E43,$T$6:$T$52,0)+5)","v":{"$error":"#N/A"}},null,{"$f":"INDIRECT(\"S\"&MATCH(G43,$T$6:$T$52,0)+5)","v":{"$error":"#N/A"}},null,{"$f":"INDIRECT(\"S\"&MATCH(I43,$T$6:$T$52,0)+5)","v":{"$error":"#N/A"}},null,{"$error":"#N/A"}]
["End of Recommended TOD Plan Interval:",null,{"$f":"E48","v":{"$error":"#N/A"}},null,{"$f":"G48","v":{"$error":"#N/A"}},null,{"$f":"I48","v":{"$error":"#N/A"}},null,{"$f":"K48","v":{"$error":"#N/A"}},null,{"$f":"C48","v":{"$error":"#N/A"}}]
["Final Recommended Left-Turn Display:"]
["Typical Guidelines per OM 15-04:",null,null,null,null,null,"OM 15-04 Criterion Category:"]
["Permissive only: one or fewer normal risk and zero elevated risk",null,null,null,null,null,null,"= safety-critical (dark orange)"]
["Protected-permissive: two or more normal risk and one or fewer elevated risk",null,null,null,null,null,null,"= safety-related only (peach)"]
["Protected only: two or more elevated risk",null,null,null,null,null,null,"= primarily volume-related w/ some safety implications (green)"]

{"sheet":"SB-EB Left","index":2,"n_rows":54,"n_cols":20,"rows_kept":54,"cut":false,"hidden":false,"merged":[[47,0,47,1],[47,2,47,3],[47,4,47,5],[47,6,47,7],[47,8,47,9],[47,10,47,11],[48,0,48,1],[48,2,48,3],[48,4,48,5],[48,6,48,7],[48,8,48,9],[48,10,48,11],[46,10,46,11],[45,2,45,3],[45,4,45,5],[45,6,45,7],[45,8,45,9],[45,10,45,11],[46,0,46,1],[46,2,46,3],[46,4,46,5],[46,6,46,7],[46,8,46,9],[43,2,43,3],[43,4,43,5],[43,6,43,7],[43,8,43,9],[43,10,43,11],[44,2,44,3],[44,4,44,5],[44,6,44,7],[44,8,44,9],[44,10,44,11],[42,2,42,3],[42,4,42,5],[42,6,42,7],[42,8,42,9],[42,10,42,11],[38,2,41,2],[38,3,41,3],[38,4,41,4],[38,5,41,5],[38,6,41,6],[38,7,41,7],[34,11,37,11],[31,7,33,7],[31,8,33,8],[31,9,33,9],[31,10,33,10],[31,11,33,11],[38,8,41,8],[38,9,41,9],[38,10,41,10],[38,11,41,11],[34,0,41,0],[34,2,37,2],[34,3,37,3],[34,4,37,4],[34,5,37,5],[27,7,30,7],[27,8,30,8],[27,9,30,9],[27,10,30,10],[27,0,33,0],[34,6,37,6],[34,7,37,7],[34,8,37,8],[34,9,37,9],[34,10,37,10],[19,11,22,11],[14,7,18,7],[14,8,18,8],[14,9,18,9],[14,10,18,10],[14,11,18,11],[27,11,30,11],[31,2,33,2],[31,3,33,3],[31,4,33,4],[31,5,33,5],[31,6,33,6],[23,8,26,8],[23,9,26,9],[23,10,26,10],[23,11,26,11],[27,2,30,2],[27,3,30,3],[27,4,30,4],[27,5,30,5],[27,6,30,6],[23,2,26,2],[23,3,26,3],[23,4,26,4],[19,0,26,0],[19,2,22,2],[19,3,22,3],[19,4,22,4],[19,5,22,5],[9,7,13,7],[9,8,13,8],[9,9,13,9],[9,10,13,10],[4,0,18,0],[19,6,22,6],[19,7,22,7],[19,8,22,8],[19,9,22,9],[19,10,22,10],[23,5,26,5],[23,6,26,6],[23,7,26,7],[9,11,13,11],[14,2,18,2],[14,3,18,3],[14,4,18,4],[14,5,18,5],[14,6,18,6],[4,7,8,7],[4,8,8,8],[4,9,8,9],[4,10,8,10],[4,11,8,11],[9,2,13,2],[9,3,13,3],[9,4,13,4],[9,5,13,5],[9,6,13,6],[4,2,8,2],[4,3,8,3],[4,4,8,4],[4,5,8,5],[4,6,8,6],[2,1,2,2],[2,3,2,4],[2,5,2,6],[2,7,2,8],[2,9,2,11],[3,14,3,19],[0,0,0,11],[1,1,1,2],[1,3,1,4],[1,5,1,6],[1,7,1,8],[1,9,1,11],[59,0,59,1],[60,3,60,5],[61,2,61,5],[61,6,61,10],[61,13,61,14],[54,0,54,5],[49,0,49,1],[49,2,49,3],[49,4,49,5],[49,6,49,7],[49,8,49,9],[49,10,49,11]]}
["Modified Left-Turn Signal Display Worksheet"]
["Intersection:",null,null,"Crash Dates:",null,null,null,"Analysis Date:"]
["Approach:","SB-EB Left",null,"Traffic Count Date:",null,null,null,"Analyst:"]
["Factors","Parameter","AM Value","Risk Level","Mid-Day Value","Risk Level","PM Value","Risk Level","Evening Value","Risk Level","Nighttime Value","Risk Level",null,null,"Hourly Totals"]
["Sight Distance","Sight Distance (e.g. horizontal or ",null,{"$f":"IF(ISBLANK(C5),\"\",IF(C5>=5.5,\"Low\",IF(C5<=0,\"Error\",\"Elevated\")))","v":""},{"$f":"IF(ISBLANK($C5),\"\",$C5)","v":""},{"$f":"IF(ISBLANK($D5),\"\",$D5)","v":""},{"$f":"IF(ISBLANK($C5),\"\",$C5)","v":""},{"$f":"IF(ISBLANK($D5),\"\",$D5)","v":""},{"$f":"IF(ISBLANK($C5),\"\",$C5)","v":""},{"$f":"IF(ISBLANK($D5),\"\",$D5)","v":""},{"$f":"IF(ISBLANK($C5),\"\",$C5)","v":""},{"$f":"IF(ISBLANK($D5),\"\",$D5)","v":""},null,null,"NB Left/U-turn","SB Thru/Right","SB Left/U-turn","NB Thru/Right","Start of Hour","Ideal TOD Plan"]
[null,"vertical curve or intersection skew)"]
[null,"≥ 5.5 sec of travel time = Low"]
[null,"< 5.5 sec of travel time = Elevated"]
[null,"   [example: for 50 mph, 5.5 sec ≈ 400 ft]"]
[null,"Left-Turn Offset*",null,{"$f":"IF(ISBLANK(C10),\"\",IF(C10>=0,\"Low\",IF(C10<-6,\"Elevated\",\"Normal\")))","v":""},{"$f":"IF(ISBLANK($C10),\"\",$C10)","v":""},{"$f":"IF(ISBLANK($D10),\"\",$D10)","v":""},{"$f":"IF(ISBLANK($C10),\"\",$C10)","v":""},{"$f":"IF(ISBLANK($D10),\"\",$D10)","v":""},{"$f":"IF(ISBLANK($C10),\"\",$C10)","v":""},{"$f":"IF(ISBLANK($D10),\"\",$D10)","v":""},{"$f":"IF(ISBLANK($C10),\"\",$C10)","v":""},{"$f":"IF(ISBLANK($D10),\"\",$D10)","v":""}]
[null,"≥ 0 ft = Low"]
[null,"0 < x ≤ -6 ft = Normal"]
[null,"< - 6 ft = Elevated"]
[null,"*See FHWA Publication: FHWA-HRT-09-036"]
[null,"Opposing Left-Turn / U-turn Use**","See Table to Right (worst hour)",null,{"$f":"IF(ISBLANK($C15),\"\",$C15)","v":"See Table to Right (worst hour)"},null,{"$f":"IF(ISBLANK($C15),\"\",$C15)","v":"See Table to Right (worst hour)"},null,{"$f":"IF(ISBLANK($C15),\"\",$C15)","v":"See Table to Right (worst hour)"},null,{"$f":"IF(ISBLANK($C15),\"\",$C15)","v":"See Table to Right (worst hour)"}]
[null,"< 30 vph = Low"]
[null,"30 ≤ x < 60 vph = Normal"]
[null,"≥ 60 vph = Elevated"]
[null,"**Not Applicable if Left-Turn Offset > 0"]
["Traffic Volume","Opposing Thru / Right Volume","See Table to Right (worst hour)",null,"See Table to Right (worst hour)",null,"See Table to Right (worst hour)",null,"See Table to Right (worst hour)",null,"See Table to Right (worst hour)"]
[null,"< 400 vph = Low"]
[null,"400 ≤ x < 800 vph = Normal"]
[null,"≥ 800 vph = Elevated"]
[null,"Left-Turn / U-turn Volume","See Table to Right (worst hour)",null,"See Table to Right (worst hour)",null,"See Table to Right (worst hour)",null,"See Table to Right (worst hour)",null,"See Table to Right (worst hour)"]
[null,"< 60 vph = Low"]
[null,"60 ≤ x < 120 vph = Normal"]
[null,"≥ 120 vph = Elevated"]
["Number of Lanes","Opposing Thru Lanes",null,{"$f":"IF(ISBLANK(C28),\"\",IF(C28=1,\"Low\",IF(C28>=3,\"Elevated\",IF(C28<=0,\"Error\",\"Normal\"))))","v":""},{"$f":"IF(ISBLANK($C28),\"\",$C28)","v":""},{"$f":"IF(ISBLANK($D28),\"\",$D28)","v":""},{"$f":"IF(ISBLANK($C28),\"\",$C28)","v":""},{"$f":"IF(ISBLANK($D28),\"\",$D28)","v":""},{"$f":"IF(ISBLANK($C28),\"\",$C28)","v":""},{"$f":"IF(ISBLANK($D28),\"\",$D28)","v":""},{"$f":"IF(ISBLANK($C28),\"\",$C28)","v":""},{"$f":"IF(ISBLANK($D28),\"\",$D28)","v":""}]
[null,"1 = Low"]
[null,"2 = Normal"]
[null,"≥ 3 = Elevated"]
[null,"Left-Turn Lanes",null,{"$f":"IF(ISBLANK(C32),\"\",IF(C32=1,\"Low\",IF(C32>=2,\"Elevated\",\"Error\")))","v":""},{"$f":"IF(ISBLANK($C32),\"\",$C32)","v":""},{"$f":"IF(ISBLANK($D32),\"\",$D32)","v":""},{"$f":"IF(ISBLANK($C32),\"\",$C32)","v":""},{"$f":"IF(ISBLANK($D32),\"\",$D32)","v":""},{"$f":"IF(ISBLANK($C32),\"\",$C32)","v":""},{"$f":"IF(ISBLANK($D32),\"\",$D32)","v":""},{"$f":"IF(ISBLANK($C32),\"\",$C32)","v":""},{"$f":"IF(ISBLANK($D32),\"\",$D32)","v":""}]
[null,"1 = Low"]
[null,"≥2 = Elevated"]
["Other","Opposing Speed Limit",null,{"$f":"IF(ISBLANK(C35),\"\",IF(C35<45,IF(C35<5,\"Error\",\"Low\"),IF(C35>50,\"Elevated\",\"Normal\")))","v":""},{"$f":"IF(ISBLANK($C35),\"\",$C35)","v":""},{"$f":"IF(ISBLANK($D35),\"\",$D35)","v":""},{"$f":"IF(ISBLANK($C35),\"\",$C35)","v":""},{"$f":"IF(ISBLANK($D35),\"\",$D35)","v":""},{"$f":"IF(ISBLANK($C35),\"\",$C35)","v":""},{"$f":"IF(ISBLANK($D35),\"\",$D35)","v":""},{"$f":"IF(ISBLANK($C35),\"\",$C35)","v":""},{"$f":"IF(ISBLANK($D35),\"\",$D35)","v":""}]
[null,"< 45 = Low"]
[null,"45 ≤ x ≤ 50 = Normal"]
[null,"> 50 = Elevated"]
[null,"Left Turn Crashes (12-month average)",null,{"$f":"IF(ISBLANK(C39),\"\",IF(C39<4,IF(C39<0,\"Error\",\"Low\"),IF(C39>=6,\"Elevated\",\"Normal\")))","v":""},{"$f":"IF(ISBLANK($C39),\"\",$C39)","v":""},{"$f":"IF(ISBLANK($D39),\"\",$D39)","v":""},{"$f":"IF(ISBLANK($C39),\"\",$C39)","v":""},{"$f":"IF(ISBLANK($D39),\"\",$D39)","v":""},{"$f":"IF(ISBLANK($C39),\"\",$C39)","v":""},{"$f":"IF(ISBLANK($D39),\"\",$D39)","v":""},{"$f":"IF(ISBLANK($C39),\"\",$C39)","v":""},{"$f":"IF(ISBLANK($D39),\"\",$D39)","v":""}]
[null,"< 4 crashes = Low"]
[null,"4 ≤ x < 6 crashes = Normal"]
[null,"≥ 6 crashes = Elevated"]
[null,null,"AM",null,"Mid-Day",null,"PM",null,"Evening",null,"Free"]
[null,"Number of Low Risk:",{"$f":"COUNTIF(D$5:D$42,\"Low\")","v":0},null,{"$f":"COUNTIF(F$5:F$42,\"Low\")","v":0},null,{"$f":"COUNTIF(H$5:H$42,\"Low\")","v":0},null,{"$f":"COUNTIF(J$5:J$42,\"Low\")","v":0},null,{"$f":"COUNTIF(L$5:L$42,\"Low\")","v":0}]
[null,"Number of Normal Risk:",{"$f":"COUNTIF(D$5:D$42,\"Normal\")","v":0},null,{"$f":"COUNTIF(F$5:F$42,\"Normal\")","v":0},null,{"$f":"COUNTIF(H$5:H$42,\"Normal\")","v":0},null,{"$f":"COUNTIF(J$5:J$42,\"Normal\")","v":0},null,{"$f":"COUNTIF(L$5:L$42,\"Normal\")","v":0}]
[null,"Number of Elevated Risk:",{"$f":"COUNTIF(D$5:D$42,\"Elevated\")","v":0},null,{"$f":"COUNTIF(F$5:F$42,\"Elevated\")","v":0},null,{"$f":"COUNTIF(H$5:H$42,\"Elevated\")","v":0},null,{"$f":"COUNTIF(J$5:J$42,\"Elevated\")","v":0},null,{"$f":"COUNTIF(L$5:L$42,\"Elevated\")","v":0}]
["Memo Recommended Left-Turn Display:",null,{"$f":"IF(C46>=2,\"Protected Only\",IF(AND(C45<=1,C46=0),\"Permissive Only\",\"Prot-Perm\"))","v":"Permissive Only"},null,{"$f":"IF(E46>=2,\"Protected Only\",IF(AND(E45<=1,E46=0),\"Permissive Only\",\"Prot-Perm\"))","v":"Permissive Only"},null,{"$f":"IF(G46>=2,\"Protected Only\",IF(AND(G45<=1,G46=0),\"Permissive Only\",\"Prot-Perm\"))","v":"Permissive Only"},null,{"$f":"IF(I46>=2,\"Protected Only\",IF(AND(I45<=1,I46=0),\"Permissive Only\",\"Prot-Perm\"))","v":"Permissive Only"},null,{"$f":"IF(K46>=2,\"Protected Only\",IF(AND(K45<=1,K46=0),\"Permissive Only\",\"Prot-Perm\"))","v":"Permissive Only"}]
["Start of Recommended TOD Plan Interval:",null,{"$f":"INDIRECT(\"S\"&MATCH(C43,$T$6:$T$52,0)+5)","v":{"$error":"#N/A"}},null,{"$f":"INDIRECT(\"S\"&MATCH(E43,$T$6:$T$52,0)+5)","v":{"$error":"#N/A"}},null,{"$f":"INDIRECT(\"S\"&MATCH(G43,$T$6:$T$52,0)+5)","v":{"$error":"#N/A"}},null,{"$f":"INDIRECT(\"S\"&MATCH(I43,$T$6:$T$52,0)+5)","v":{"$error":"#N/A"}},null,{"$error":"#N/A"}]
["End of Recommended TOD Plan Interval:",null,{"$f":"E48","v":{"$error":"#N/A"}},null,{"$f":"G48","v":{"$error":"#N/A"}},null,{"$f":"I48","v":{"$error":"#N/A"}},null,{"$f":"K48","v":{"$error":"#N/A"}},null,{"$f":"C48","v":{"$error":"#N/A"}}]
["Final Recommended Left-Turn Display:"]
["Typical Guidelines per OM 15-04:",null,null,null,null,null,"OM 15-04 Criterion Category:"]
["Permissive only: one or fewer normal risk and zero elevated risk",null,null,null,null,null,null,"= safety-critical (dark orange)"]
["Protected-permissive: two or more normal risk and one or fewer elevated risk",null,null,null,null,null,null,"= safety-related only (peach)"]
["Protected only: two or more elevated risk",null,null,null,null,null,null,"= primarily volume-related w/ some safety implications (green)"]

{"sheet":"EB-NB Left","index":3,"n_rows":54,"n_cols":20,"rows_kept":54,"cut":false,"hidden":false,"merged":[[0,0,0,11],[1,1,1,2],[1,3,1,4],[1,5,1,6],[1,7,1,8],[1,9,1,11],[2,1,2,2],[2,3,2,4],[2,5,2,6],[2,7,2,8],[2,9,2,11],[3,14,3,19],[4,0,18,0],[4,2,8,2],[4,3,8,3],[4,4,8,4],[4,5,8,5],[4,6,8,6],[4,7,8,7],[4,8,8,8],[4,9,8,9],[4,10,8,10],[4,11,8,11],[9,2,13,2],[9,3,13,3],[9,4,13,4],[9,5,13,5],[9,6,13,6],[9,7,13,7],[9,8,13,8],[9,9,13,9],[9,10,13,10],[9,11,13,11],[14,2,18,2],[14,3,18,3],[14,4,18,4],[14,5,18,5],[14,6,18,6],[14,7,18,7],[14,8,18,8],[14,9,18,9],[14,10,18,10],[14,11,18,11],[19,0,26,0],[19,2,22,2],[19,3,22,3],[19,4,22,4],[19,5,22,5],[19,6,22,6],[19,7,22,7],[19,8,22,8],[19,9,22,9],[19,10,22,10],[19,11,22,11],[23,2,26,2],[23,3,26,3],[23,4,26,4],[23,5,26,5],[23,6,26,6],[23,7,26,7],[23,8,26,8],[23,9,26,9],[23,10,26,10],[23,11,26,11],[27,0,33,0],[27,2,30,2],[27,3,30,3],[27,4,30,4],[27,5,30,5],[27,6,30,6],[27,8,30,8],[27,9,30,9],[27,10,30,10],[27,11,30,11],[31,2,33,2],[31,3,33,3],[31,4,33,4],[31,5,33,5],[31,6,33,6],[34,0,41,0],[34,2,37,2],[34,3,37,3],[34,4,37,4],[34,5,37,5],[27,7,30,7],[34,8,37,8],[34,9,37,9],[34,10,37,10],[34,11,37,11],[31,7,33,7],[31,8,33,8],[31,9,33,9],[31,10,33,10],[31,11,33,11],[38,3,41,3],[38,4,41,4],[38,5,41,5],[38,6,41,6],[38,7,41,7],[34,6,37,6],[34,7,37,7],[38,8,41,8],[38,9,41,9],[38,10,41,10],[38,11,41,11],[42,2,42,3],[42,4,42,5],[42,6,42,7],[42,8,42,9],[42,10,42,11],[38,2,41,2],[43,2,43,3],[43,4,43,5],[43,6,43,7],[43,8,43,9],[43,10,43,11],[44,2,44,3],[44,4,44,5],[44,6,44,7],[44,8,44,9],[44,10,44,11],[45,2,45,3],[45,4,45,5],[45,6,45,7],[45,8,45,9],[45,10,45,11],[48,0,48,1],[48,2,48,3],[48,4,48,5],[48,6,48,7],[48,8,48,9],[48,10,48,11],[46,0,46,1],[46,2,46,3],[46,4,46,5],[46,6,46,7],[46,8,46,9],[46,10,46,11],[47,0,47,1],[47,2,47,3],[47,4,47,5],[47,6,47,7],[47,8,47,9],[47,10,47,11],[49,6,49,7],[49,8,49,9],[49,10,49,11],[54,0,54,5],[59,0,59,1],[60,3,60,5],[61,2,61,5],[61,6,61,10],[61,13,61,14],[49,0,49,1],[49,2,49,3],[49,4,49,5]]}
["Modified Left-Turn Signal Display Worksheet"]
["Intersection:",null,null,"Crash Dates:",null,null,null,"Analysis Date:"]
["Approach:","EB-NB Left",null,"Traffic Count Date:",null,null,null,"Analyst:"]
["Factors","Parameter","AM Value","Risk Level","Mid-Day Value","Risk Level","PM Value","Risk Level","Evening Value","Risk Level","Nighttime Value","Risk Level",null,null,"Hourly Totals"]
["Sight Distance","Sight Distance (e.g. horizontal or ",null,{"$f":"IF(ISBLANK(C5),\"\",IF(C5>=5.5,\"Low\",IF(C5<=0,\"Error\",\"Elevated\")))","v":""},{"$f":"IF(ISBLANK($C5),\"\",$C5)","v":""},{"$f":"IF(ISBLANK($D5),\"\",$D5)","v":""},{"$f":"IF(ISBLANK($C5),\"\",$C5)","v":""},{"$f":"IF(ISBLANK($D5),\"\",$D5)","v":""},{"$f":"IF(ISBLANK($C5),\"\",$C5)","v":""},{"$f":"IF(ISBLANK($D5),\"\",$D5)","v":""},{"$f":"IF(ISBLANK($C5),\"\",$C5)","v":""},{"$f":"IF(ISBLANK($D5),\"\",$D5)","v":""},null,null,"EB Left/U-turn","WB Thru/Right","WB Left/U-turn","EB Thru/Right","Start of Hour","Ideal TOD Plan"]
[null,"vertical curve or intersection skew)"]
[null,"≥ 5.5 sec of travel time = Low"]
[null,"< 5.5 sec of travel time = Elevated"]
[null,"   [example: for 50 mph, 5.5 sec ≈ 400 ft]"]
[null,"Left-Turn Offset*",null,{"$f":"IF(ISBLANK(C10),\"\",IF(C10>=0,\"Low\",IF(C10<-6,\"Elevated\",\"Normal\")))","v":""},{"$f":"IF(ISBLANK($C10),\"\",$C10)","v":""},{"$f":"IF(ISBLANK($D10),\"\",$D10)","v":""},{"$f":"IF(ISBLANK($C10),\"\",$C10)","v":""},{"$f":"IF(ISBLANK($D10),\"\",$D10)","v":""},{"$f":"IF(ISBLANK($C10),\"\",$C10)","v":""},{"$f":"IF(ISBLANK($D10),\"\",$D10)","v":""},{"$f":"IF(ISBLANK($C10),\"\",$C10)","v":""},{"$f":"IF(ISBLANK($D10),\"\",$D10)","v":""}]
[null,"≥ 0 ft = Low"]
[null,"0 < x ≤ -6 ft = Normal"]
[null,"< - 6 ft = Elevated"]
[null,"*See FHWA Publication: FHWA-HRT-09-036"]
[null,"Opposing Left-Turn / U-turn Use**","See Table to Right (worst hour)",null,{"$f":"IF(ISBLANK($C15),\"\",$C15)","v":"See Table to Right (worst hour)"},null,{"$f":"IF(ISBLANK($C15),\"\",$C15)","v":"See Table to Right (worst hour)"},null,{"$f":"IF(ISBLANK($C15),\"\",$C15)","v":"See Table to Right (worst hour)"},null,{"$f":"IF(ISBLANK($C15),\"\",$C15)","v":"See Table to Right (worst hour)"}]
[null,"< 30 vph = Low"]
[null,"30 ≤ x < 60 vph = Normal"]
[null,"≥ 60 vph = Elevated"]
[null,"**Not Applicable if Left-Turn Offset > 0"]
["Traffic Volume","Opposing Thru / Right Volume","See Table to Right (worst hour)",null,"See Table to Right (worst hour)",null,"See Table to Right (worst hour)",null,"See Table to Right (worst hour)",null,"See Table to Right (worst hour)"]
[null,"< 400 vph = Low"]
[null,"400 ≤ x < 800 vph = Normal"]
[null,"≥ 800 vph = Elevated"]
[null,"Left-Turn / U-turn Volume","See Table to Right (worst hour)",null,"See Table to Right (worst hour)",null,"See Table to Right (worst hour)",null,"See Table to Right (worst hour)",null,"See Table to Right (worst hour)"]
[null,"< 60 vph = Low"]
[null,"60 ≤ x < 120 vph = Normal"]
[null,"≥ 120 vph = Elevated"]
["Number of Lanes","Opposing Thru Lanes",null,{"$f":"IF(ISBLANK(C28),\"\",IF(C28=1,\"Low\",IF(C28>=3,\"Elevated\",IF(C28<=0,\"Error\",\"Normal\"))))","v":""},{"$f":"IF(ISBLANK($C28),\"\",$C28)","v":""},{"$f":"IF(ISBLANK($D28),\"\",$D28)","v":""},{"$f":"IF(ISBLANK($C28),\"\",$C28)","v":""},{"$f":"IF(ISBLANK($D28),\"\",$D28)","v":""},{"$f":"IF(ISBLANK($C28),\"\",$C28)","v":""},{"$f":"IF(ISBLANK($D28),\"\",$D28)","v":""},{"$f":"IF(ISBLANK($C28),\"\",$C28)","v":""},{"$f":"IF(ISBLANK($D28),\"\",$D28)","v":""}]
[null,"1 = Low"]
[null,"2 = Normal"]
[null,"≥ 3 = Elevated"]
[null,"Left-Turn Lanes",null,{"$f":"IF(ISBLANK(C32),\"\",IF(C32=1,\"Low\",IF(C32>=2,\"Elevated\",\"Error\")))","v":""},{"$f":"IF(ISBLANK($C32),\"\",$C32)","v":""},{"$f":"IF(ISBLANK($D32),\"\",$D32)","v":""},{"$f":"IF(ISBLANK($C32),\"\",$C32)","v":""},{"$f":"IF(ISBLANK($D32),\"\",$D32)","v":""},{"$f":"IF(ISBLANK($C32),\"\",$C32)","v":""},{"$f":"IF(ISBLANK($D32),\"\",$D32)","v":""},{"$f":"IF(ISBLANK($C32),\"\",$C32)","v":""},{"$f":"IF(ISBLANK($D32),\"\",$D32)","v":""}]
[null,"1 = Low"]
[null,"≥2 = Elevated"]
["Other","Opposing Speed Limit",null,{"$f":"IF(ISBLANK(C35),\"\",IF(C35<45,IF(C35<5,\"Error\",\"Low\"),IF(C35>50,\"Elevated\",\"Normal\")))","v":""},{"$f":"IF(ISBLANK($C35),\"\",$C35)","v":""},{"$f":"IF(ISBLANK($D35),\"\",$D35)","v":""},{"$f":"IF(ISBLANK($C35),\"\",$C35)","v":""},{"$f":"IF(ISBLANK($D35),\"\",$D35)","v":""},{"$f":"IF(ISBLANK($C35),\"\",$C35)","v":""},{"$f":"IF(ISBLANK($D35),\"\",$D35)","v":""},{"$f":"IF(ISBLANK($C35),\"\",$C35)","v":""},{"$f":"IF(ISBLANK($D35),\"\",$D35)","v":""}]
[null,"< 45 = Low"]
[null,"45 ≤ x ≤ 50 = Normal"]
[null,"> 50 = Elevated"]
[null,"Left Turn Crashes (12-month average)",null,{"$f":"IF(ISBLANK(C39),\"\",IF(C39<4,IF(C39<0,\"Error\",\"Low\"),IF(C39>=6,\"Elevated\",\"Normal\")))","v":""},{"$f":"IF(ISBLANK($C39),\"\",$C39)","v":""},{"$f":"IF(ISBLANK($D39),\"\",$D39)","v":""},{"$f":"IF(ISBLANK($C39),\"\",$C39)","v":""},{"$f":"IF(ISBLANK($D39),\"\",$D39)","v":""},{"$f":"IF(ISBLANK($C39),\"\",$C39)","v":""},{"$f":"IF(ISBLANK($D39),\"\",$D39)","v":""},{"$f":"IF(ISBLANK($C39),\"\",$C39)","v":""},{"$f":"IF(ISBLANK($D39),\"\",$D39)","v":""}]
[null,"< 4 crashes = Low"]
[null,"4 ≤ x < 6 crashes = Normal"]
[null,"≥ 6 crashes = Elevated"]
[null,null,"AM",null,"Mid-Day",null,"PM",null,"Evening",null,"Free"]
[null,"Number of Low Risk:",{"$f":"COUNTIF(D$5:D$42,\"Low\")","v":0},null,{"$f":"COUNTIF(F$5:F$42,\"Low\")","v":0},null,{"$f":"COUNTIF(H$5:H$42,\"Low\")","v":0},null,{"$f":"COUNTIF(J$5:J$42,\"Low\")","v":0},null,{"$f":"COUNTIF(L$5:L$42,\"Low\")","v":0}]
[null,"Number of Normal Risk:",{"$f":"COUNTIF(D$5:D$42,\"Normal\")","v":0},null,{"$f":"COUNTIF(F$5:F$42,\"Normal\")","v":0},null,{"$f":"COUNTIF(H$5:H$42,\"Normal\")","v":0},null,{"$f":"COUNTIF(J$5:J$42,\"Normal\")","v":0},null,{"$f":"COUNTIF(L$5:L$42,\"Normal\")","v":0}]
[null,"Number of Elevated Risk:",{"$f":"COUNTIF(D$5:D$42,\"Elevated\")","v":0},null,{"$f":"COUNTIF(F$5:F$42,\"Elevated\")","v":0},null,{"$f":"COUNTIF(H$5:H$42,\"Elevated\")","v":0},null,{"$f":"COUNTIF(J$5:J$42,\"Elevated\")","v":0},null,{"$f":"COUNTIF(L$5:L$42,\"Elevated\")","v":0}]
["Memo Recommended Left-Turn Display:",null,{"$f":"IF(C46>=2,\"Protected Only\",IF(AND(C45<=1,C46=0),\"Permissive Only\",\"Prot-Perm\"))","v":"Permissive Only"},null,{"$f":"IF(E46>=2,\"Protected Only\",IF(AND(E45<=1,E46=0),\"Permissive Only\",\"Prot-Perm\"))","v":"Permissive Only"},null,{"$f":"IF(G46>=2,\"Protected Only\",IF(AND(G45<=1,G46=0),\"Permissive Only\",\"Prot-Perm\"))","v":"Permissive Only"},null,{"$f":"IF(I46>=2,\"Protected Only\",IF(AND(I45<=1,I46=0),\"Permissive Only\",\"Prot-Perm\"))","v":"Permissive Only"},null,{"$f":"IF(K46>=2,\"Protected Only\",IF(AND(K45<=1,K46=0),\"Permissive Only\",\"Prot-Perm\"))","v":"Permissive Only"}]
["Start of Recommended TOD Plan Interval:",null,{"$f":"INDIRECT(\"S\"&MATCH(C43,$T$6:$T$52,0)+5)","v":{"$error":"#N/A"}},null,{"$f":"INDIRECT(\"S\"&MATCH(E43,$T$6:$T$52,0)+5)","v":{"$error":"#N/A"}},null,{"$f":"INDIRECT(\"S\"&MATCH(G43,$T$6:$T$52,0)+5)","v":{"$error":"#N/A"}},null,{"$f":"INDIRECT(\"S\"&MATCH(I43,$T$6:$T$52,0)+5)","v":{"$error":"#N/A"}},null,{"$error":"#N/A"}]
["End of Recommended TOD Plan Interval:",null,{"$f":"E48","v":{"$error":"#N/A"}},null,{"$f":"G48","v":{"$error":"#N/A"}},null,{"$f":"I48","v":{"$error":"#N/A"}},null,{"$f":"K48","v":{"$error":"#N/A"}},null,{"$f":"C48","v":{"$error":"#N/A"}}]
["Final Recommended Left-Turn Display:"]
["Typical Guidelines per OM 15-04:",null,null,null,null,null,"OM 15-04 Criterion Category:"]
["Permissive only: one or fewer normal risk and zero elevated risk",null,null,null,null,null,null,"= safety-critical (dark orange)"]
["Protected-permissive: two or more normal risk and one or fewer elevated risk",null,null,null,null,null,null,"= safety-related only (peach)"]
["Protected only: two or more elevated risk",null,null,null,null,null,null,"= primarily volume-related w/ some safety implications (green)"]

{"sheet":"WB-SB Left","index":4,"n_rows":54,"n_cols":20,"rows_kept":54,"cut":false,"hidden":false,"merged":[[47,0,47,1],[47,2,47,3],[47,4,47,5],[47,6,47,7],[47,8,47,9],[47,10,47,11],[48,0,48,1],[48,2,48,3],[48,4,48,5],[48,6,48,7],[48,8,48,9],[48,10,48,11],[46,10,46,11],[45,2,45,3],[45,4,45,5],[45,6,45,7],[45,8,45,9],[45,10,45,11],[46,0,46,1],[46,2,46,3],[46,4,46,5],[46,6,46,7],[46,8,46,9],[43,2,43,3],[43,4,43,5],[43,6,43,7],[43,8,43,9],[43,10,43,11],[44,2,44,3],[44,4,44,5],[44,6,44,7],[44,8,44,9],[44,10,44,11],[42,2,42,3],[42,4,42,5],[42,6,42,7],[42,8,42,9],[42,10,42,11],[38,2,41,2],[38,3,41,3],[38,4,41,4],[38,5,41,5],[38,6,41,6],[38,7,41,7],[34,11,37,11],[31,7,33,7],[31,8,33,8],[31,9,33,9],[31,10,33,10],[31,11,33,11],[38,8,41,8],[38,9,41,9],[38,10,41,10],[38,11,41,11],[34,0,41,0],[34,2,37,2],[34,3,37,3],[34,4,37,4],[34,5,37,5],[27,7,30,7],[27,8,30,8],[27,9,30,9],[27,10,30,10],[27,0,33,0],[34,6,37,6],[34,7,37,7],[34,8,37,8],[34,9,37,9],[34,10,37,10],[19,11,22,11],[14,7,18,7],[14,8,18,8],[14,9,18,9],[14,10,18,10],[14,11,18,11],[27,11,30,11],[31,2,33,2],[31,3,33,3],[31,4,33,4],[31,5,33,5],[31,6,33,6],[23,8,26,8],[23,9,26,9],[23,10,26,10],[23,11,26,11],[27,2,30,2],[27,3,30,3],[27,4,30,4],[27,5,30,5],[27,6,30,6],[23,2,26,2],[23,3,26,3],[23,4,26,4],[19,0,26,0],[19,2,22,2],[19,3,22,3],[19,4,22,4],[19,5,22,5],[9,7,13,7],[9,8,13,8],[9,9,13,9],[9,10,13,10],[4,0,18,0],[19,6,22,6],[19,7,22,7],[19,8,22,8],[19,9,22,9],[19,10,22,10],[23,5,26,5],[23,6,26,6],[23,7,26,7],[9,11,13,11],[14,2,18,2],[14,3,18,3],[14,4,18,4],[14,5,18,5],[14,6,18,6],[4,7,8,7],[4,8,8,8],[4,9,8,9],[4,10,8,10],[4,11,8,11],[9,2,13,2],[9,3,13,3],[9,4,13,4],[9,5,13,5],[9,6,13,6],[4,2,8,2],[4,3,8,3],[4,4,8,4],[4,5,8,5],[4,6,8,6],[2,1,2,2],[2,3,2,4],[2,5,2,6],[2,7,2,8],[2,9,2,11],[3,14,3,19],[0,0,0,11],[1,1,1,2],[1,3,1,4],[1,5,1,6],[1,7,1,8],[1,9,1,11],[59,0,59,1],[60,3,60,5],[61,2,61,5],[61,6,61,10],[61,13,61,14],[54,0,54,5],[49,0,49,1],[49,2,49,3],[49,4,49,5],[49,6,49,7],[49,8,49,9],[49,10,49,11]]}
["Modified Left-Turn Signal Display Worksheet"]
["Intersection:",null,null,"Crash Dates:",null,null,null,"Analysis Date:"]
["Approach:","WB-SB Left",null,"Traffic Count Date:",null,null,null,"Analyst:"]
["Factors","Parameter","AM Value","Risk Level","Mid-Day Value","Risk Level","PM Value","Risk Level","Evening Value","Risk Level","Nighttime Value","Risk Level",null,null,"Hourly Totals"]
["Sight Distance","Sight Distance (e.g. horizontal or ",null,{"$f":"IF(ISBLANK(C5),\"\",IF(C5>=5.5,\"Low\",IF(C5<=0,\"Error\",\"Elevated\")))","v":""},{"$f":"IF(ISBLANK($C5),\"\",$C5)","v":""},{"$f":"IF(ISBLANK($D5),\"\",$D5)","v":""},{"$f":"IF(ISBLANK($C5),\"\",$C5)","v":""},{"$f":"IF(ISBLANK($D5),\"\",$D5)","v":""},{"$f":"IF(ISBLANK($C5),\"\",$C5)","v":""},{"$f":"IF(ISBLANK($D5),\"\",$D5)","v":""},{"$f":"IF(ISBLANK($C5),\"\",$C5)","v":""},{"$f":"IF(ISBLANK($D5),\"\",$D5)","v":""},null,null,"EB Left/U-turn","WB Thru/Right","WB Left/U-turn","EB Thru/Right","Start of Hour","Ideal TOD Plan"]
[null,"vertical curve or intersection skew)"]
[null,"≥ 5.5 sec of travel time = Low"]
[null,"< 5.5 sec of travel time = Elevated"]
[null,"   [example: for 50 mph, 5.5 sec ≈ 400 ft]"]
[null,"Left-Turn Offset*",null,{"$f":"IF(ISBLANK(C10),\"\",IF(C10>=0,\"Low\",IF(C10<-6,\"Elevated\",\"Normal\")))","v":""},{"$f":"IF(ISBLANK($C10),\"\",$C10)","v":""},{"$f":"IF(ISBLANK($D10),\"\",$D10)","v":""},{"$f":"IF(ISBLANK($C10),\"\",$C10)","v":""},{"$f":"IF(ISBLANK($D10),\"\",$D10)","v":""},{"$f":"IF(ISBLANK($C10),\"\",$C10)","v":""},{"$f":"IF(ISBLANK($D10),\"\",$D10)","v":""},{"$f":"IF(ISBLANK($C10),\"\",$C10)","v":""},{"$f":"IF(ISBLANK($D10),\"\",$D10)","v":""}]
[null,"≥ 0 ft = Low"]
[null,"0 < x ≤ -6 ft = Normal"]
[null,"< - 6 ft = Elevated"]
[null,"*See FHWA Publication: FHWA-HRT-09-036"]
[null,"Opposing Left-Turn / U-turn Use**","See Table to Right (worst hour)",null,{"$f":"IF(ISBLANK($C15),\"\",$C15)","v":"See Table to Right (worst hour)"},null,{"$f":"IF(ISBLANK($C15),\"\",$C15)","v":"See Table to Right (worst hour)"},null,{"$f":"IF(ISBLANK($C15),\"\",$C15)","v":"See Table to Right (worst hour)"},null,{"$f":"IF(ISBLANK($C15),\"\",$C15)","v":"See Table to Right (worst hour)"}]
[null,"< 30 vph = Low"]
[null,"30 ≤ x < 60 vph = Normal"]
[null,"≥ 60 vph = Elevated"]
[null,"**Not Applicable if Left-Turn Offset > 0"]
["Traffic Volume","Opposing Thru / Right Volume","See Table to Right (worst hour)",null,"See Table to Right (worst hour)",null,"See Table to Right (worst hour)",null,"See Table to Right (worst hour)",null,"See Table to Right (worst hour)"]
[null,"< 400 vph = Low"]
[null,"400 ≤ x < 800 vph = Normal"]
[null,"≥ 800 vph = Elevated"]
[null,"Left-Turn / U-turn Volume","See Table to Right (worst hour)",null,"See Table to Right (worst hour)",null,"See Table to Right (worst hour)",null,"See Table to Right (worst hour)",null,"See Table to Right (worst hour)"]
[null,"< 60 vph = Low"]
[null,"60 ≤ x < 120 vph = Normal"]
[null,"≥ 120 vph = Elevated"]
["Number of Lanes","Opposing Thru Lanes",null,{"$f":"IF(ISBLANK(C28),\"\",IF(C28=1,\"Low\",IF(C28>=3,\"Elevated\",IF(C28<=0,\"Error\",\"Normal\"))))","v":""},{"$f":"IF(ISBLANK($C28),\"\",$C28)","v":""},{"$f":"IF(ISBLANK($D28),\"\",$D28)","v":""},{"$f":"IF(ISBLANK($C28),\"\",$C28)","v":""},{"$f":"IF(ISBLANK($D28),\"\",$D28)","v":""},{"$f":"IF(ISBLANK($C28),\"\",$C28)","v":""},{"$f":"IF(ISBLANK($D28),\"\",$D28)","v":""},{"$f":"IF(ISBLANK($C28),\"\",$C28)","v":""},{"$f":"IF(ISBLANK($D28),\"\",$D28)","v":""}]
[null,"1 = Low"]
[null,"2 = Normal"]
[null,"≥ 3 = Elevated"]
[null,"Left-Turn Lanes",null,{"$f":"IF(ISBLANK(C32),\"\",IF(C32=1,\"Low\",IF(C32>=2,\"Elevated\",\"Error\")))","v":""},{"$f":"IF(ISBLANK($C32),\"\",$C32)","v":""},{"$f":"IF(ISBLANK($D32),\"\",$D32)","v":""},{"$f":"IF(ISBLANK($C32),\"\",$C32)","v":""},{"$f":"IF(ISBLANK($D32),\"\",$D32)","v":""},{"$f":"IF(ISBLANK($C32),\"\",$C32)","v":""},{"$f":"IF(ISBLANK($D32),\"\",$D32)","v":""},{"$f":"IF(ISBLANK($C32),\"\",$C32)","v":""},{"$f":"IF(ISBLANK($D32),\"\",$D32)","v":""}]
[null,"1 = Low"]
[null,"≥2 = Elevated"]
["Other","Opposing Speed Limit",null,{"$f":"IF(ISBLANK(C35),\"\",IF(C35<45,IF(C35<5,\"Error\",\"Low\"),IF(C35>50,\"Elevated\",\"Normal\")))","v":""},{"$f":"IF(ISBLANK($C35),\"\",$C35)","v":""},{"$f":"IF(ISBLANK($D35),\"\",$D35)","v":""},{"$f":"IF(ISBLANK($C35),\"\",$C35)","v":""},{"$f":"IF(ISBLANK($D35),\"\",$D35)","v":""},{"$f":"IF(ISBLANK($C35),\"\",$C35)","v":""},{"$f":"IF(ISBLANK($D35),\"\",$D35)","v":""},{"$f":"IF(ISBLANK($C35),\"\",$C35)","v":""},{"$f":"IF(ISBLANK($D35),\"\",$D35)","v":""}]
[null,"< 45 = Low"]
[null,"45 ≤ x ≤ 50 = Normal"]
[null,"> 50 = Elevated"]
[null,"Left Turn Crashes (12-month average)",null,{"$f":"IF(ISBLANK(C39),\"\",IF(C39<4,IF(C39<0,\"Error\",\"Low\"),IF(C39>=6,\"Elevated\",\"Normal\")))","v":""},{"$f":"IF(ISBLANK($C39),\"\",$C39)","v":""},{"$f":"IF(ISBLANK($D39),\"\",$D39)","v":""},{"$f":"IF(ISBLANK($C39),\"\",$C39)","v":""},{"$f":"IF(ISBLANK($D39),\"\",$D39)","v":""},{"$f":"IF(ISBLANK($C39),\"\",$C39)","v":""},{"$f":"IF(ISBLANK($D39),\"\",$D39)","v":""},{"$f":"IF(ISBLANK($C39),\"\",$C39)","v":""},{"$f":"IF(ISBLANK($D39),\"\",$D39)","v":""}]
[null,"< 4 crashes = Low"]
[null,"4 ≤ x < 6 crashes = Normal"]
[null,"≥ 6 crashes = Elevated"]
[null,null,"AM",null,"Mid-Day",null,"PM",null,"Evening",null,"Free"]
[null,"Number of Low Risk:",{"$f":"COUNTIF(D$5:D$42,\"Low\")","v":0},null,{"$f":"COUNTIF(F$5:F$42,\"Low\")","v":0},null,{"$f":"COUNTIF(H$5:H$42,\"Low\")","v":0},null,{"$f":"COUNTIF(J$5:J$42,\"Low\")","v":0},null,{"$f":"COUNTIF(L$5:L$42,\"Low\")","v":0}]
[null,"Number of Normal Risk:",{"$f":"COUNTIF(D$5:D$42,\"Normal\")","v":0},null,{"$f":"COUNTIF(F$5:F$42,\"Normal\")","v":0},null,{"$f":"COUNTIF(H$5:H$42,\"Normal\")","v":0},null,{"$f":"COUNTIF(J$5:J$42,\"Normal\")","v":0},null,{"$f":"COUNTIF(L$5:L$42,\"Normal\")","v":0}]
[null,"Number of Elevated Risk:",{"$f":"COUNTIF(D$5:D$42,\"Elevated\")","v":0},null,{"$f":"COUNTIF(F$5:F$42,\"Elevated\")","v":0},null,{"$f":"COUNTIF(H$5:H$42,\"Elevated\")","v":0},null,{"$f":"COUNTIF(J$5:J$42,\"Elevated\")","v":0},null,{"$f":"COUNTIF(L$5:L$42,\"Elevated\")","v":0}]
["Memo Recommended Left-Turn Display:",null,{"$f":"IF(C46>=2,\"Protected Only\",IF(AND(C45<=1,C46=0),\"Permissive Only\",\"Prot-Perm\"))","v":"Permissive Only"},null,{"$f":"IF(E46>=2,\"Protected Only\",IF(AND(E45<=1,E46=0),\"Permissive Only\",\"Prot-Perm\"))","v":"Permissive Only"},null,{"$f":"IF(G46>=2,\"Protected Only\",IF(AND(G45<=1,G46=0),\"Permissive Only\",\"Prot-Perm\"))","v":"Permissive Only"},null,{"$f":"IF(I46>=2,\"Protected Only\",IF(AND(I45<=1,I46=0),\"Permissive Only\",\"Prot-Perm\"))","v":"Permissive Only"},null,{"$f":"IF(K46>=2,\"Protected Only\",IF(AND(K45<=1,K46=0),\"Permissive Only\",\"Prot-Perm\"))","v":"Permissive Only"}]
["Start of Recommended TOD Plan Interval:",null,{"$f":"INDIRECT(\"S\"&MATCH(C43,$T$6:$T$52,0)+5)","v":{"$error":"#N/A"}},null,{"$f":"INDIRECT(\"S\"&MATCH(E43,$T$6:$T$52,0)+5)","v":{"$error":"#N/A"}},null,{"$f":"INDIRECT(\"S\"&MATCH(G43,$T$6:$T$52,0)+5)","v":{"$error":"#N/A"}},null,{"$f":"INDIRECT(\"S\"&MATCH(I43,$T$6:$T$52,0)+5)","v":{"$error":"#N/A"}},null,{"$error":"#N/A"}]
["End of Recommended TOD Plan Interval:",null,{"$f":"E48","v":{"$error":"#N/A"}},null,{"$f":"G48","v":{"$error":"#N/A"}},null,{"$f":"I48","v":{"$error":"#N/A"}},null,{"$f":"K48","v":{"$error":"#N/A"}},null,{"$f":"C48","v":{"$error":"#N/A"}}]
["Final Recommended Left-Turn Display:"]
["Typical Guidelines per OM 15-04:",null,null,null,null,null,"OM 15-04 Criterion Category:"]
["Permissive only: one or fewer normal risk and zero elevated risk",null,null,null,null,null,null,"= safety-critical (dark orange)"]
["Protected-permissive: two or more normal risk and one or fewer elevated risk",null,null,null,null,null,null,"= safety-related only (peach)"]
["Protected only: two or more elevated risk",null,null,null,null,null,null,"= primarily volume-related w/ some safety implications (green)"]

{"sheet":"N-S","index":5,"n_rows":107,"n_cols":23,"rows_kept":107,"cut":false,"hidden":false,"merged":[[12,1,12,4],[12,5,12,8],[12,9,12,12],[12,13,12,16],[12,18,12,22],[9,0,9,1],[9,2,9,16],[10,0,10,1],[10,2,10,16],[11,1,11,4],[11,5,11,8],[11,9,11,12],[11,13,11,16],[6,0,6,1],[6,2,6,16],[7,0,7,1],[7,2,7,16],[8,0,8,1],[8,2,8,16],[3,0,3,1],[3,2,3,16],[4,0,4,1],[4,2,4,16],[5,0,5,1],[5,2,5,16],[0,0,0,1],[0,2,0,16],[1,0,1,1],[1,2,1,16],[2,0,2,1],[2,2,2,16]]}
["Study Name"]
["Start Date"]
["Start Time"]
["Site Code",null,""]
["Project",null,""]
["",null,""]
["",null,""]
["",null,""]
["",null,""]
["Type",null,"Road"]
["Classification",null,"Totals"]
[]
[null,null,null,null,null,null,null,null,null,null,null,null,null,null,null,null,null,null,"Hourly Totals"]
[null,null,null,null,null,null,null,null,null,null,null,null,null,null,null,null,null,null,"NB Left/U-turn","SB Thru/Right","SB Left/U-turn","NB Thru/Right","Start of Hour"]
[null,null,null,null,null,null,null,null,null,null,null,null,null,null,null,null,null,"6:00 AM",{"$f":"INDIRECT(\"$L$\"&MATCH($R15,$A$15:$A$110,0)+14)+INDIRECT(\"$L$\"&MATCH($R15,$A$15:$A$110,0)+15)+INDIRECT(\"$L$\"&MATCH($R15,$A$15:$A$110,0)+16)+INDIRECT(\"$L$\"&MATCH($R15,$A$15:$A$110,0)+17)+INDIRECT(\"$M$\"&MATCH($R15,$A$15:$A$110,0)+14)+INDIRECT(\"$M$\"&MATCH($R15,$A$15:$A$110,0)+15)+INDIRECT(\"$M$\"&MATCH($R15,$A$15:$A$110,0)+16)+INDIRECT(\"$M$\"&MATCH($R15,$A$15:$A$110,0)+17)","v":{"$error":"#N/A"}},{"$f":"INDIRECT(\"$B$\"&MATCH($R15,$A$15:$A$110,0)+14)+INDIRECT(\"$B$\"&MATCH($R15,$A$15:$A$110,0)+15)+INDIRECT(\"$B$\"&MATCH($R15,$A$15:$A$110,0)+16)+INDIRECT(\"$B$\"&MATCH($R15,$A$15:$A$110,0)+17)+INDIRECT(\"$C$\"&MATCH($R15,$A$15:$A$110,0)+14)+INDIRECT(\"$C$\"&MATCH($R15,$A$15:$A$110,0)+15)+INDIRECT(\"$C$\"&MATCH($R15,$A$15:$A$110,0)+16)+INDIRECT(\"$C$\"&MATCH($R15,$A$15:$A$110,0)+17)","v":{"$error":"#N/A"}},{"$f":"INDIRECT(\"$D$\"&MATCH($R15,$A$15:$A$110,0)+14)+INDIRECT(\"$D$\"&MATCH($R15,$A$15:$A$110,0)+15)+INDIRECT(\"$D$\"&MATCH($R15,$A$15:$A$110,0)+16)+INDIRECT(\"$D$\"&MATCH($R15,$A$15:$A$110,0)+17)+INDIRECT(\"$E$\"&MATCH($R15,$A$15:$A$110,0)+14)+INDIRECT(\"$E$\"&MATCH($R15,$A$15:$A$110,0)+15)+INDIRECT(\"$E$\"&MATCH($R15,$A$15:$A$110,0)+16)+INDIRECT(\"$E$\"&MATCH($R15,$A$15:$A$110,0)+17)","v":{"$error":"#N/A"}},{"$f":"INDIRECT(\"$J$\"&MATCH($R15,$A$15:$A$110,0)+14)+INDIRECT(\"$J$\"&MATCH($R15,$A$15:$A$110,0)+15)+INDIRECT(\"$J$\"&MATCH($R15,$A$15:$A$110,0)+16)+INDIRECT(\"$J$\"&MATCH($R15,$A$15:$A$110,0)+17)+INDIRECT(\"$K$\"&MATCH($R15,$A$15:$A$110,0)+14)+INDIRECT(\"$K$\"&MATCH($R15,$A$15:$A$110,0)+15)+INDIRECT(\"$K$\"&MATCH($R15,$A$15:$A$110,0)+16)+INDIRECT(\"$K$\"&MATCH($R15,$A$15:$A$110,0)+17)","v":{"$error":"#N/A"}},{"$f":"R15","v":"6:00 AM"}]
[]
[]
[]
[null,null,null,null,null,null,null,null,null,null,null,null,null,null,null,null,null,"7:00 AM",{"$f":"INDIRECT(\"$L$\"&MATCH($R19,$A$15:$A$110,0)+14)+INDIRECT(\"$L$\"&MATCH($R19,$A$15:$A$110,0)+15)+INDIRECT(\"$L$\"&MATCH($R19,$A$15:$A$110,0)+16)+INDIRECT(\"$L$\"&MATCH($R19,$A$15:$A$110,0)+17)+INDIRECT(\"$M$\"&MATCH($R19,$A$15:$A$110,0)+14)+INDIRECT(\"$M$\"&MATCH($R19,$A$15:$A$110,0)+15)+INDIRECT(\"$M$\"&MATCH($R19,$A$15:$A$110,0)+16)+INDIRECT(\"$M$\"&MATCH($R19,$A$15:$A$110,0)+17)","v":{"$error":"#N/A"}},{"$f":"INDIRECT(\"$B$\"&MATCH($R19,$A$15:$A$110,0)+14)+INDIRECT(\"$B$\"&MATCH($R19,$A$15:$A$110,0)+15)+INDIRECT(\"$B$\"&MATCH($R19,$A$15:$A$110,0)+16)+INDIRECT(\"$B$\"&MATCH($R19,$A$15:$A$110,0)+17)+INDIRECT(\"$C$\"&MATCH($R19,$A$15:$A$110,0)+14)+INDIRECT(\"$C$\"&MATCH($R19,$A$15:$A$110,0)+15)+INDIRECT(\"$C$\"&MATCH($R19,$A$15:$A$110,0)+16)+INDIRECT(\"$C$\"&MATCH($R19,$A$15:$A$110,0)+17)","v":{"$error":"#N/A"}},{"$f":"INDIRECT(\"$D$\"&MATCH($R19,$A$15:$A$110,0)+14)+INDIRECT(\"$D$\"&MATCH($R19,$A$15:$A$110,0)+15)+INDIRECT(\"$D$\"&MATCH($R19,$A$15:$A$110,0)+16)+INDIRECT(\"$D$\"&MATCH($R19,$A$15:$A$110,0)+17)+INDIRECT(\"$E$\"&MATCH($R19,$A$15:$A$110,0)+14)+INDIRECT(\"$E$\"&MATCH($R19,$A$15:$A$110,0)+15)+INDIRECT(\"$E$\"&MATCH($R19,$A$15:$A$110,0)+16)+INDIRECT(\"$E$\"&MATCH($R19,$A$15:$A$110,0)+17)","v":{"$error":"#N/A"}},{"$f":"INDIRECT(\"$J$\"&MATCH($R19,$A$15:$A$110,0)+14)+INDIRECT(\"$J$\"&MATCH($R19,$A$15:$A$110,0)+15)+INDIRECT(\"$J$\"&MATCH($R19,$A$15:$A$110,0)+16)+INDIRECT(\"$J$\"&MATCH($R19,$A$15:$A$110,0)+17)+INDIRECT(\"$K$\"&MATCH($R19,$A$15:$A$110,0)+14)+INDIRECT(\"$K$\"&MATCH($R19,$A$15:$A$110,0)+15)+INDIRECT(\"$K$\"&MATCH($R19,$A$15:$A$110,0)+16)+INDIRECT(\"$K$\"&MATCH($R19,$A$15:$A$110,0)+17)","v":{"$error":"#N/A"}},{"$f":"R19","v":"7:00 AM"}]
[]
[]
[]
[null,null,null,null,null,null,null,null,null,null,null,null,null,null,null,null,null,"8:00 AM",{"$f":"INDIRECT(\"$L$\"&MATCH($R23,$A$15:$A$110,0)+14)+INDIRECT(\"$L$\"&MATCH($R23,$A$15:$A$110,0)+15)+INDIRECT(\"$L$\"&MATCH($R23,$A$15:$A$110,0)+16)+INDIRECT(\"$L$\"&MATCH($R23,$A$15:$A$110,0)+17)+INDIRECT(\"$M$\"&MATCH($R23,$A$15:$A$110,0)+14)+INDIRECT(\"$M$\"&MATCH($R23,$A$15:$A$110,0)+15)+INDIRECT(\"$M$\"&MATCH($R23,$A$15:$A$110,0)+16)+INDIRECT(\"$M$\"&MATCH($R23,$A$15:$A$110,0)+17)","v":{"$error":"#N/A"}},{"$f":"INDIRECT(\"$B$\"&MATCH($R23,$A$15:$A$110,0)+14)+INDIRECT(\"$B$\"&MATCH($R23,$A$15:$A$110,0)+15)+INDIRECT(\"$B$\"&MATCH($R23,$A$15:$A$110,0)+16)+INDIRECT(\"$B$\"&MATCH($R23,$A$15:$A$110,0)+17)+INDIRECT(\"$C$\"&MATCH($R23,$A$15:$A$110,0)+14)+INDIRECT(\"$C$\"&MATCH($R23,$A$15:$A$110,0)+15)+INDIRECT(\"$C$\"&MATCH($R23,$A$15:$A$110,0)+16)+INDIRECT(\"$C$\"&MATCH($R23,$A$15:$A$110,0)+17)","v":{"$error":"#N/A"}},{"$f":"INDIRECT(\"$D$\"&MATCH($R23,$A$15:$A$110,0)+14)+INDIRECT(\"$D$\"&MATCH($R23,$A$15:$A$110,0)+15)+INDIRECT(\"$D$\"&MATCH($R23,$A$15:$A$110,0)+16)+INDIRECT(\"$D$\"&MATCH($R23,$A$15:$A$110,0)+17)+INDIRECT(\"$E$\"&MATCH($R23,$A$15:$A$110,0)+14)+INDIRECT(\"$E$\"&MATCH($R23,$A$15:$A$110,0)+15)+INDIRECT(\"$E$\"&MATCH($R23,$A$15:$A$110,0)+16)+INDIRECT(\"$E$\"&MATCH($R23,$A$15:$A$110,0)+17)","v":{"$error":"#N/A"}},{"$f":"INDIRECT(\"$J$\"&MATCH($R23,$A$15:$A$110,0)+14)+INDIRECT(\"$J$\"&MATCH($R23,$A$15:$A$110,0)+15)+INDIRECT(\"$J$\"&MATCH($R23,$A$15:$A$110,0)+16)+INDIRECT(\"$J$\"&MATCH($R23,$A$15:$A$110,0)+17)+INDIRECT(\"$K$\"&MATCH($R23,$A$15:$A$110,0)+14)+INDIRECT(\"$K$\"&MATCH($R23,$A$15:$A$110,0)+15)+INDIRECT(\"$K$\"&MATCH($R23,$A$15:$A$110,0)+16)+INDIRECT(\"$K$\"&MATCH($R23,$A$15:$A$110,0)+17)","v":{"$error":"#N/A"}},{"$f":"R23","v":"8:00 AM"}]
[]
[]
[]
[null,null,null,null,null,null,null,null,null,null,null,null,null,null,null,null,null,"9:00 AM",{"$f":"INDIRECT(\"$L$\"&MATCH($R27,$A$15:$A$110,0)+14)+INDIRECT(\"$L$\"&MATCH($R27,$A$15:$A$110,0)+15)+INDIRECT(\"$L$\"&MATCH($R27,$A$15:$A$110,0)+16)+INDIRECT(\"$L$\"&MATCH($R27,$A$15:$A$110,0)+17)+INDIRECT(\"$M$\"&MATCH($R27,$A$15:$A$110,0)+14)+INDIRECT(\"$M$\"&MATCH($R27,$A$15:$A$110,0)+15)+INDIRECT(\"$M$\"&MATCH($R27,$A$15:$A$110,0)+16)+INDIRECT(\"$M$\"&MATCH($R27,$A$15:$A$110,0)+17)","v":{"$error":"#N/A"}},{"$f":"INDIRECT(\"$B$\"&MATCH($R27,$A$15:$A$110,0)+14)+INDIRECT(\"$B$\"&MATCH($R27,$A$15:$A$110,0)+15)+INDIRECT(\"$B$\"&MATCH($R27,$A$15:$A$110,0)+16)+INDIRECT(\"$B$\"&MATCH($R27,$A$15:$A$110,0)+17)+INDIRECT(\"$C$\"&MATCH($R27,$A$15:$A$110,0)+14)+INDIRECT(\"$C$\"&MATCH($R27,$A$15:$A$110,0)+15)+INDIRECT(\"$C$\"&MATCH($R27,$A$15:$A$110,0)+16)+INDIRECT(\"$C$\"&MATCH($R27,$A$15:$A$110,0)+17)","v":{"$error":"#N/A"}},{"$f":"INDIRECT(\"$D$\"&MATCH($R27,$A$15:$A$110,0)+14)+INDIRECT(\"$D$\"&MATCH($R27,$A$15:$A$110,0)+15)+INDIRECT(\"$D$\"&MATCH($R27,$A$15:$A$110,0)+16)+INDIRECT(\"$D$\"&MATCH($R27,$A$15:$A$110,0)+17)+INDIRECT(\"$E$\"&MATCH($R27,$A$15:$A$110,0)+14)+INDIRECT(\"$E$\"&MATCH($R27,$A$15:$A$110,0)+15)+INDIRECT(\"$E$\"&MATCH($R27,$A$15:$A$110,0)+16)+INDIRECT(\"$E$\"&MATCH($R27,$A$15:$A$110,0)+17)","v":{"$error":"#N/A"}},{"$f":"INDIRECT(\"$J$\"&MATCH($R27,$A$15:$A$110,0)+14)+INDIRECT(\"$J$\"&MATCH($R27,$A$15:$A$110,0)+15)+INDIRECT(\"$J$\"&MATCH($R27,$A$15:$A$110,0)+16)+INDIRECT(\"$J$\"&MATCH($R27,$A$15:$A$110,0)+17)+INDIRECT(\"$K$\"&MATCH($R27,$A$15:$A$110,0)+14)+INDIRECT(\"$K$\"&MATCH($R27,$A$15:$A$110,0)+15)+INDIRECT(\"$K$\"&MATCH($R27,$A$15:$A$110,0)+16)+INDIRECT(\"$K$\"&MATCH($R27,$A$15:$A$110,0)+17)","v":{"$error":"#N/A"}},{"$f":"R27","v":"9:00 AM"}]
[]
[]
[]
[null,null,null,null,null,null,null,null,null,null,null,null,null,null,null,null,null,"10:00 AM",{"$f":"INDIRECT(\"$L$\"&MATCH($R31,$A$15:$A$110,0)+14)+INDIRECT(\"$L$\"&MATCH($R31,$A$15:$A$110,0)+15)+INDIRECT(\"$L$\"&MATCH($R31,$A$15:$A$110,0)+16)+INDIRECT(\"$L$\"&MATCH($R31,$A$15:$A$110,0)+17)+INDIRECT(\"$M$\"&MATCH($R31,$A$15:$A$110,0)+14)+INDIRECT(\"$M$\"&MATCH($R31,$A$15:$A$110,0)+15)+INDIRECT(\"$M$\"&MATCH($R31,$A$15:$A$110,0)+16)+INDIRECT(\"$M$\"&MATCH($R31,$A$15:$A$110,0)+17)","v":{"$error":"#N/A"}},{"$f":"INDIRECT(\"$B$\"&MATCH($R31,$A$15:$A$110,0)+14)+INDIRECT(\"$B$\"&MATCH($R31,$A$15:$A$110,0)+15)+INDIRECT(\"$B$\"&MATCH($R31,$A$15:$A$110,0)+16)+INDIRECT(\"$B$\"&MATCH($R31,$A$15:$A$110,0)+17)+INDIRECT(\"$C$\"&MATCH($R31,$A$15:$A$110,0)+14)+INDIRECT(\"$C$\"&MATCH($R31,$A$15:$A$110,0)+15)+INDIRECT(\"$C$\"&MATCH($R31,$A$15:$A$110,0)+16)+INDIRECT(\"$C$\"&MATCH($R31,$A$15:$A$110,0)+17)","v":{"$error":"#N/A"}},{"$f":"INDIRECT(\"$D$\"&MATCH($R31,$A$15:$A$110,0)+14)+INDIRECT(\"$D$\"&MATCH($R31,$A$15:$A$110,0)+15)+INDIRECT(\"$D$\"&MATCH($R31,$A$15:$A$110,0)+16)+INDIRECT(\"$D$\"&MATCH($R31,$A$15:$A$110,0)+17)+INDIRECT(\"$E$\"&MATCH($R31,$A$15:$A$110,0)+14)+INDIRECT(\"$E$\"&MATCH($R31,$A$15:$A$110,0)+15)+INDIRECT(\"$E$\"&MATCH($R31,$A$15:$A$110,0)+16)+INDIRECT(\"$E$\"&MATCH($R31,$A$15:$A$110,0)+17)","v":{"$error":"#N/A"}},{"$f":"INDIRECT(\"$J$\"&MATCH($R31,$A$15:$A$110,0)+14)+INDIRECT(\"$J$\"&MATCH($R31,$A$15:$A$110,0)+15)+INDIRECT(\"$J$\"&MATCH($R31,$A$15:$A$110,0)+16)+INDIRECT(\"$J$\"&MATCH($R31,$A$15:$A$110,0)+17)+INDIRECT(\"$K$\"&MATCH($R31,$A$15:$A$110,0)+14)+INDIRECT(\"$K$\"&MATCH($R31,$A$15:$A$110,0)+15)+INDIRECT(\"$K$\"&MATCH($R31,$A$15:$A$110,0)+16)+INDIRECT(\"$K$\"&MATCH($R31,$A$15:$A$110,0)+17)","v":{"$error":"#N/A"}},{"$f":"R31","v":"10:00 AM"}]
[]
[]
[]
[null,null,null,null,null,null,null,null,null,null,null,null,null,null,null,null,null,"11:00 AM",{"$f":"INDIRECT(\"$L$\"&MATCH($R35,$A$15:$A$110,0)+14)+INDIRECT(\"$L$\"&MATCH($R35,$A$15:$A$110,0)+15)+INDIRECT(\"$L$\"&MATCH($R35,$A$15:$A$110,0)+16)+INDIRECT(\"$L$\"&MATCH($R35,$A$15:$A$110,0)+17)+INDIRECT(\"$M$\"&MATCH($R35,$A$15:$A$110,0)+14)+INDIRECT(\"$M$\"&MATCH($R35,$A$15:$A$110,0)+15)+INDIRECT(\"$M$\"&MATCH($R35,$A$15:$A$110,0)+16)+INDIRECT(\"$M$\"&MATCH($R35,$A$15:$A$110,0)+17)","v":{"$error":"#N/A"}},{"$f":"INDIRECT(\"$B$\"&MATCH($R35,$A$15:$A$110,0)+14)+INDIRECT(\"$B$\"&MATCH($R35,$A$15:$A$110,0)+15)+INDIRECT(\"$B$\"&MATCH($R35,$A$15:$A$110,0)+16)+INDIRECT(\"$B$\"&MATCH($R35,$A$15:$A$110,0)+17)+INDIRECT(\"$C$\"&MATCH($R35,$A$15:$A$110,0)+14)+INDIRECT(\"$C$\"&MATCH($R35,$A$15:$A$110,0)+15)+INDIRECT(\"$C$\"&MATCH($R35,$A$15:$A$110,0)+16)+INDIRECT(\"$C$\"&MATCH($R35,$A$15:$A$110,0)+17)","v":{"$error":"#N/A"}},{"$f":"INDIRECT(\"$D$\"&MATCH($R35,$A$15:$A$110,0)+14)+INDIRECT(\"$D$\"&MATCH($R35,$A$15:$A$110,0)+15)+INDIRECT(\"$D$\"&MATCH($R35,$A$15:$A$110,0)+16)+INDIRECT(\"$D$\"&MATCH($R35,$A$15:$A$110,0)+17)+INDIRECT(\"$E$\"&MATCH($R35,$A$15:$A$110,0)+14)+INDIRECT(\"$E$\"&MATCH($R35,$A$15:$A$110,0)+15)+INDIRECT(\"$E$\"&MATCH($R35,$A$15:$A$110,0)+16)+INDIRECT(\"$E$\"&MATCH($R35,$A$15:$A$110,0)+17)","v":{"$error":"#N/A"}},{"$f":"INDIRECT(\"$J$\"&MATCH($R35,$A$15:$A$110,0)+14)+INDIRECT(\"$J$\"&MATCH($R35,$A$15:$A$110,0)+15)+INDIRECT(\"$J$\"&MATCH($R35,$A$15:$A$110,0)+16)+INDIRECT(\"$J$\"&MATCH($R35,$A$15:$A$110,0)+17)+INDIRECT(\"$K$\"&MATCH($R35,$A$15:$A$110,0)+14)+INDIRECT(\"$K$\"&MATCH($R35,$A$15:$A$110,0)+15)+INDIRECT(\"$K$\"&MATCH($R35,$A$15:$A$110,0)+16)+INDIRECT(\"$K$\"&MATCH($R35,$A$15:$A$110,0)+17)","v":{"$error":"#N/A"}},{"$f":"R35","v":"11:00 AM"}]
[]
[]
[]
[null,null,null,null,null,null,null,null,null,null,null,null,null,null,null,null,null,"12:00 PM",{"$f":"INDIRECT(\"$L$\"&MATCH($R39,$A$15:$A$110,0)+14)+INDIRECT(\"$L$\"&MATCH($R39,$A$15:$A$110,0)+15)+INDIRECT(\"$L$\"&MATCH($R39,$A$15:$A$110,0)+16)+INDIRECT(\"$L$\"&MATCH($R39,$A$15:$A$110,0)+17)+INDIRECT(\"$M$\"&MATCH($R39,$A$15:$A$110,0)+14)+INDIRECT(\"$M$\"&MATCH($R39,$A$15:$A$110,0)+15)+INDIRECT(\"$M$\"&MATCH($R39,$A$15:$A$110,0)+16)+INDIRECT(\"$M$\"&MATCH($R39,$A$15:$A$110,0)+17)","v":{"$error":"#N/A"}},{"$f":"INDIRECT(\"$B$\"&MATCH($R39,$A$15:$A$110,0)+14)+INDIRECT(\"$B$\"&MATCH($R39,$A$15:$A$110,0)+15)+INDIRECT(\"$B$\"&MATCH($R39,$A$15:$A$110,0)+16)+INDIRECT(\"$B$\"&MATCH($R39,$A$15:$A$110,0)+17)+INDIRECT(\"$C$\"&MATCH($R39,$A$15:$A$110,0)+14)+INDIRECT(\"$C$\"&MATCH($R39,$A$15:$A$110,0)+15)+INDIRECT(\"$C$\"&MATCH($R39,$A$15:$A$110,0)+16)+INDIRECT(\"$C$\"&MATCH($R39,$A$15:$A$110,0)+17)","v":{"$error":"#N/A"}},{"$f":"INDIRECT(\"$D$\"&MATCH($R39,$A$15:$A$110,0)+14)+INDIRECT(\"$D$\"&MATCH($R39,$A$15:$A$110,0)+15)+INDIRECT(\"$D$\"&MATCH($R39,$A$15:$A$110,0)+16)+INDIRECT(\"$D$\"&MATCH($R39,$A$15:$A$110,0)+17)+INDIRECT(\"$E$\"&MATCH($R39,$A$15:$A$110,0)+14)+INDIRECT(\"$E$\"&MATCH($R39,$A$15:$A$110,0)+15)+INDIRECT(\"$E$\"&MATCH($R39,$A$15:$A$110,0)+16)+INDIRECT(\"$E$\"&MATCH($R39,$A$15:$A$110,0)+17)","v":{"$error":"#N/A"}},{"$f":"INDIRECT(\"$J$\"&MATCH($R39,$A$15:$A$110,0)+14)+INDIRECT(\"$J$\"&MATCH($R39,$A$15:$A$110,0)+15)+INDIRECT(\"$J$\"&MATCH($R39,$A$15:$A$110,0)+16)+INDIRECT(\"$J$\"&MATCH($R39,$A$15:$A$110,0)+17)+INDIRECT(\"$K$\"&MATCH($R39,$A$15:$A$110,0)+14)+INDIRECT(\"$K$\"&MATCH($R39,$A$15:$A$110,0)+15)+INDIRECT(\"$K$\"&MATCH($R39,$A$15:$A$110,0)+16)+INDIRECT(\"$K$\"&MATCH($R39,$A$15:$A$110,0)+17)","v":{"$error":"#N/A"}},{"$f":"R39","v":"12:00 PM"}]
[]
[]
[]
[null,null,null,null,null,null,null,null,null,null,null,null,null,null,null,null,null,"1:00 PM",{"$f":"INDIRECT(\"$L$\"&MATCH($R43,$A$15:$A$110,0)+14)+INDIRECT(\"$L$\"&MATCH($R43,$A$15:$A$110,0)+15)+INDIRECT(\"$L$\"&MATCH($R43,$A$15:$A$110,0)+16)+INDIRECT(\"$L$\"&MATCH($R43,$A$15:$A$110,0)+17)+INDIRECT(\"$M$\"&MATCH($R43,$A$15:$A$110,0)+14)+INDIRECT(\"$M$\"&MATCH($R43,$A$15:$A$110,0)+15)+INDIRECT(\"$M$\"&MATCH($R43,$A$15:$A$110,0)+16)+INDIRECT(\"$M$\"&MATCH($R43,$A$15:$A$110,0)+17)","v":{"$error":"#N/A"}},{"$f":"INDIRECT(\"$B$\"&MATCH($R43,$A$15:$A$110,0)+14)+INDIRECT(\"$B$\"&MATCH($R43,$A$15:$A$110,0)+15)+INDIRECT(\"$B$\"&MATCH($R43,$A$15:$A$110,0)+16)+INDIRECT(\"$B$\"&MATCH($R43,$A$15:$A$110,0)+17)+INDIRECT(\"$C$\"&MATCH($R43,$A$15:$A$110,0)+14)+INDIRECT(\"$C$\"&MATCH($R43,$A$15:$A$110,0)+15)+INDIRECT(\"$C$\"&MATCH($R43,$A$15:$A$110,0)+16)+INDIRECT(\"$C$\"&MATCH($R43,$A$15:$A$110,0)+17)","v":{"$error":"#N/A"}},{"$f":"INDIRECT(\"$D$\"&MATCH($R43,$A$15:$A$110,0)+14)+INDIRECT(\"$D$\"&MATCH($R43,$A$15:$A$110,0)+15)+INDIRECT(\"$D$\"&MATCH($R43,$A$15:$A$110,0)+16)+INDIRECT(\"$D$\"&MATCH($R43,$A$15:$A$110,0)+17)+INDIRECT(\"$E$\"&MATCH($R43,$A$15:$A$110,0)+14)+INDIRECT(\"$E$\"&MATCH($R43,$A$15:$A$110,0)+15)+INDIRECT(\"$E$\"&MATCH($R43,$A$15:$A$110,0)+16)+INDIRECT(\"$E$\"&MATCH($R43,$A$15:$A$110,0)+17)","v":{"$error":"#N/A"}},{"$f":"INDIRECT(\"$J$\"&MATCH($R43,$A$15:$A$110,0)+14)+INDIRECT(\"$J$\"&MATCH($R43,$A$15:$A$110,0)+15)+INDIRECT(\"$J$\"&MATCH($R43,$A$15:$A$110,0)+16)+INDIRECT(\"$J$\"&MATCH($R43,$A$15:$A$110,0)+17)+INDIRECT(\"$K$\"&MATCH($R43,$A$15:$A$110,0)+14)+INDIRECT(\"$K$\"&MATCH($R43,$A$15:$A$110,0)+15)+INDIRECT(\"$K$\"&MATCH($R43,$A$15:$A$110,0)+16)+INDIRECT(\"$K$\"&MATCH($R43,$A$15:$A$110,0)+17)","v":{"$error":"#N/A"}},{"$f":"R43","v":"1:00 PM"}]
[]
[]
[]
[null,null,null,null,null,null,null,null,null,null,null,null,null,null,null,null,null,"2:00 PM",{"$f":"INDIRECT(\"$L$\"&MATCH($R47,$A$15:$A$110,0)+14)+INDIRECT(\"$L$\"&MATCH($R47,$A$15:$A$110,0)+15)+INDIRECT(\"$L$\"&MATCH($R47,$A$15:$A$110,0)+16)+INDIRECT(\"$L$\"&MATCH($R47,$A$15:$A$110,0)+17)+INDIRECT(\"$M$\"&MATCH($R47,$A$15:$A$110,0)+14)+INDIRECT(\"$M$\"&MATCH($R47,$A$15:$A$110,0)+15)+INDIRECT(\"$M$\"&MATCH($R47,$A$15:$A$110,0)+16)+INDIRECT(\"$M$\"&MATCH($R47,$A$15:$A$110,0)+17)","v":{"$error":"#N/A"}},{"$f":"INDIRECT(\"$B$\"&MATCH($R47,$A$15:$A$110,0)+14)+INDIRECT(\"$B$\"&MATCH($R47,$A$15:$A$110,0)+15)+INDIRECT(\"$B$\"&MATCH($R47,$A$15:$A$110,0)+16)+INDIRECT(\"$B$\"&MATCH($R47,$A$15:$A$110,0)+17)+INDIRECT(\"$C$\"&MATCH($R47,$A$15:$A$110,0)+14)+INDIRECT(\"$C$\"&MATCH($R47,$A$15:$A$110,0)+15)+INDIRECT(\"$C$\"&MATCH($R47,$A$15:$A$110,0)+16)+INDIRECT(\"$C$\"&MATCH($R47,$A$15:$A$110,0)+17)","v":{"$error":"#N/A"}},{"$f":"INDIRECT(\"$D$\"&MATCH($R47,$A$15:$A$110,0)+14)+INDIRECT(\"$D$\"&MATCH($R47,$A$15:$A$110,0)+15)+INDIRECT(\"$D$\"&MATCH($R47,$A$15:$A$110,0)+16)+INDIRECT(\"$D$\"&MATCH($R47,$A$15:$A$110,0)+17)+INDIRECT(\"$E$\"&MATCH($R47,$A$15:$A$110,0)+14)+INDIRECT(\"$E$\"&MATCH($R47,$A$15:$A$110,0)+15)+INDIRECT(\"$E$\"&MATCH($R47,$A$15:$A$110,0)+16)+INDIRECT(\"$E$\"&MATCH($R47,$A$15:$A$110,0)+17)","v":{"$error":"#N/A"}},{"$f":"INDIRECT(\"$J$\"&MATCH($R47,$A$15:$A$110,0)+14)+INDIRECT(\"$J$\"&MATCH($R47,$A$15:$A$110,0)+15)+INDIRECT(\"$J$\"&MATCH($R47,$A$15:$A$110,0)+16)+INDIRECT(\"$J$\"&MATCH($R47,$A$15:$A$110,0)+17)+INDIRECT(\"$K$\"&MATCH($R47,$A$15:$A$110,0)+14)+INDIRECT(\"$K$\"&MATCH($R47,$A$15:$A$110,0)+15)+INDIRECT(\"$K$\"&MATCH($R47,$A$15:$A$110,0)+16)+INDIRECT(\"$K$\"&MATCH($R47,$A$15:$A$110,0)+17)","v":{"$error":"#N/A"}},{"$f":"R47","v":"2:00 PM"}]
[]
[]
[]
[null,null,null,null,null,null,null,null,null,null,null,null,null,null,null,null,null,"3:00 PM",{"$f":"INDIRECT(\"$L$\"&MATCH($R51,$A$15:$A$110,0)+14)+INDIRECT(\"$L$\"&MATCH($R51,$A$15:$A$110,0)+15)+INDIRECT(\"$L$\"&MATCH($R51,$A$15:$A$110,0)+16)+INDIRECT(\"$L$\"&MATCH($R51,$A$15:$A$110,0)+17)+INDIRECT(\"$M$\"&MATCH($R51,$A$15:$A$110,0)+14)+INDIRECT(\"$M$\"&MATCH($R51,$A$15:$A$110,0)+15)+INDIRECT(\"$M$\"&MATCH($R51,$A$15:$A$110,0)+16)+INDIRECT(\"$M$\"&MATCH($R51,$A$15:$A$110,0)+17)","v":{"$error":"#N/A"}},{"$f":"INDIRECT(\"$B$\"&MATCH($R51,$A$15:$A$110,0)+14)+INDIRECT(\"$B$\"&MATCH($R51,$A$15:$A$110,0)+15)+INDIRECT(\"$B$\"&MATCH($R51,$A$15:$A$110,0)+16)+INDIRECT(\"$B$\"&MATCH($R51,$A$15:$A$110,0)+17)+INDIRECT(\"$C$\"&MATCH($R51,$A$15:$A$110,0)+14)+INDIRECT(\"$C$\"&MATCH($R51,$A$15:$A$110,0)+15)+INDIRECT(\"$C$\"&MATCH($R51,$A$15:$A$110,0)+16)+INDIRECT(\"$C$\"&MATCH($R51,$A$15:$A$110,0)+17)","v":{"$error":"#N/A"}},{"$f":"INDIRECT(\"$D$\"&MATCH($R51,$A$15:$A$110,0)+14)+INDIRECT(\"$D$\"&MATCH($R51,$A$15:$A$110,0)+15)+INDIRECT(\"$D$\"&MATCH($R51,$A$15:$A$110,0)+16)+INDIRECT(\"$D$\"&MATCH($R51,$A$15:$A$110,0)+17)+INDIRECT(\"$E$\"&MATCH($R51,$A$15:$A$110,0)+14)+INDIRECT(\"$E$\"&MATCH($R51,$A$15:$A$110,0)+15)+INDIRECT(\"$E$\"&MATCH($R51,$A$15:$A$110,0)+16)+INDIRECT(\"$E$\"&MATCH($R51,$A$15:$A$110,0)+17)","v":{"$error":"#N/A"}},{"$f":"INDIRECT(\"$J$\"&MATCH($R51,$A$15:$A$110,0)+14)+INDIRECT(\"$J$\"&MATCH($R51,$A$15:$A$110,0)+15)+INDIRECT(\"$J$\"&MATCH($R51,$A$15:$A$110,0)+16)+INDIRECT(\"$J$\"&MATCH($R51,$A$15:$A$110,0)+17)+INDIRECT(\"$K$\"&MATCH($R51,$A$15:$A$110,0)+14)+INDIRECT(\"$K$\"&MATCH($R51,$A$15:$A$110,0)+15)+INDIRECT(\"$K$\"&MATCH($R51,$A$15:$A$110,0)+16)+INDIRECT(\"$K$\"&MATCH($R51,$A$15:$A$110,0)+17)","v":{"$error":"#N/A"}},{"$f":"R51","v":"3:00 PM"}]
[]
[]
[]
[null,null,null,null,null,null,null,null,null,null,null,null,null,null,null,null,null,"4:00 PM",{"$f":"INDIRECT(\"$L$\"&MATCH($R55,$A$15:$A$110,0)+14)+INDIRECT(\"$L$\"&MATCH($R55,$A$15:$A$110,0)+15)+INDIRECT(\"$L$\"&MATCH($R55,$A$15:$A$110,0)+16)+INDIRECT(\"$L$\"&MATCH($R55,$A$15:$A$110,0)+17)+INDIRECT(\"$M$\"&MATCH($R55,$A$15:$A$110,0)+14)+INDIRECT(\"$M$\"&MATCH($R55,$A$15:$A$110,0)+15)+INDIRECT(\"$M$\"&MATCH($R55,$A$15:$A$110,0)+16)+INDIRECT(\"$M$\"&MATCH($R55,$A$15:$A$110,0)+17)","v":{"$error":"#N/A"}},{"$f":"INDIRECT(\"$B$\"&MATCH($R55,$A$15:$A$110,0)+14)+INDIRECT(\"$B$\"&MATCH($R55,$A$15:$A$110,0)+15)+INDIRECT(\"$B$\"&MATCH($R55,$A$15:$A$110,0)+16)+INDIRECT(\"$B$\"&MATCH($R55,$A$15:$A$110,0)+17)+INDIRECT(\"$C$\"&MATCH($R55,$A$15:$A$110,0)+14)+INDIRECT(\"$C$\"&MATCH($R55,$A$15:$A$110,0)+15)+INDIRECT(\"$C$\"&MATCH($R55,$A$15:$A$110,0)+16)+INDIRECT(\"$C$\"&MATCH($R55,$A$15:$A$110,0)+17)","v":{"$error":"#N/A"}},{"$f":"INDIRECT(\"$D$\"&MATCH($R55,$A$15:$A$110,0)+14)+INDIRECT(\"$D$\"&MATCH($R55,$A$15:$A$110,0)+15)+INDIRECT(\"$D$\"&MATCH($R55,$A$15:$A$110,0)+16)+INDIRECT(\"$D$\"&MATCH($R55,$A$15:$A$110,0)+17)+INDIRECT(\"$E$\"&MATCH($R55,$A$15:$A$110,0)+14)+INDIRECT(\"$E$\"&MATCH($R55,$A$15:$A$110,0)+15)+INDIRECT(\"$E$\"&MATCH($R55,$A$15:$A$110,0)+16)+INDIRECT(\"$E$\"&MATCH($R55,$A$15:$A$110,0)+17)","v":{"$error":"#N/A"}},{"$f":"INDIRECT(\"$J$\"&MATCH($R55,$A$15:$A$110,0)+14)+INDIRECT(\"$J$\"&MATCH($R55,$A$15:$A$110,0)+15)+INDIRECT(\"$J$\"&MATCH($R55,$A$15:$A$110,0)+16)+INDIRECT(\"$J$\"&MATCH($R55,$A$15:$A$110,0)+17)+INDIRECT(\"$K$\"&MATCH($R55,$A$15:$A$110,0)+14)+INDIRECT(\"$K$\"&MATCH($R55,$A$15:$A$110,0)+15)+INDIRECT(\"$K$\"&MATCH($R55,$A$15:$A$110,0)+16)+INDIRECT(\"$K$\"&MATCH($R55,$A$15:$A$110,0)+17)","v":{"$error":"#N/A"}},{"$f":"R55","v":"4:00 PM"}]
[]
[]
[]
[null,null,null,null,null,null,null,null,null,null,null,null,null,null,null,null,null,"5:00 PM",{"$f":"INDIRECT(\"$L$\"&MATCH($R59,$A$15:$A$110,0)+14)+INDIRECT(\"$L$\"&MATCH($R59,$A$15:$A$110,0)+15)+INDIRECT(\"$L$\"&MATCH($R59,$A$15:$A$110,0)+16)+INDIRECT(\"$L$\"&MATCH($R59,$A$15:$A$110,0)+17)+INDIRECT(\"$M$\"&MATCH($R59,$A$15:$A$110,0)+14)+INDIRECT(\"$M$\"&MATCH($R59,$A$15:$A$110,0)+15)+INDIRECT(\"$M$\"&MATCH($R59,$A$15:$A$110,0)+16)+INDIRECT(\"$M$\"&MATCH($R59,$A$15:$A$110,0)+17)","v":{"$error":"#N/A"}},{"$f":"INDIRECT(\"$B$\"&MATCH($R59,$A$15:$A$110,0)+14)+INDIRECT(\"$B$\"&MATCH($R59,$A$15:$A$110,0)+15)+INDIRECT(\"$B$\"&MATCH($R59,$A$15:$A$110,0)+16)+INDIRECT(\"$B$\"&MATCH($R59,$A$15:$A$110,0)+17)+INDIRECT(\"$C$\"&MATCH($R59,$A$15:$A$110,0)+14)+INDIRECT(\"$C$\"&MATCH($R59,$A$15:$A$110,0)+15)+INDIRECT(\"$C$\"&MATCH($R59,$A$15:$A$110,0)+16)+INDIRECT(\"$C$\"&MATCH($R59,$A$15:$A$110,0)+17)","v":{"$error":"#N/A"}},{"$f":"INDIRECT(\"$D$\"&MATCH($R59,$A$15:$A$110,0)+14)+INDIRECT(\"$D$\"&MATCH($R59,$A$15:$A$110,0)+15)+INDIRECT(\"$D$\"&MATCH($R59,$A$15:$A$110,0)+16)+INDIRECT(\"$D$\"&MATCH($R59,$A$15:$A$110,0)+17)+INDIRECT(\"$E$\"&MATCH($R59,$A$15:$A$110,0)+14)+INDIRECT(\"$E$\"&MATCH($R59,$A$15:$A$110,0)+15)+INDIRECT(\"$E$\"&MATCH($R59,$A$15:$A$110,0)+16)+INDIRECT(\"$E$\"&MATCH($R59,$A$15:$A$110,0)+17)","v":{"$error":"#N/A"}},{"$f":"INDIRECT(\"$J$\"&MATCH($R59,$A$15:$A$110,0)+14)+INDIRECT(\"$J$\"&MATCH($R59,$A$15:$A$110,0)+15)+INDIRECT(\"$J$\"&MATCH($R59,$A$15:$A$110,0)+16)+INDIRECT(\"$J$\"&MATCH($R59,$A$15:$A$110,0)+17)+INDIRECT(\"$K$\"&MATCH($R59,$A$15:$A$110,0)+14)+INDIRECT(\"$K$\"&MATCH($R59,$A$15:$A$110,0)+15)+INDIRECT(\"$K$\"&MATCH($R59,$A$15:$A$110,0)+16)+INDIRECT(\"$K$\"&MATCH($R59,$A$15:$A$110,0)+17)","v":{"$error":"#N/A"}},{"$f":"R59","v":"5:00 PM"}]
[]
[]
[]
[null,null,null,null,null,null,null,null,null,null,null,null,null,null,null,null,null,"6:00 PM",{"$f":"INDIRECT(\"$L$\"&MATCH($R63,$A$15:$A$110,0)+14)+INDIRECT(\"$L$\"&MATCH($R63,$A$15:$A$110,0)+15)+INDIRECT(\"$L$\"&MATCH($R63,$A$15:$A$110,0)+16)+INDIRECT(\"$L$\"&MATCH($R63,$A$15:$A$110,0)+17)+INDIRECT(\"$M$\"&MATCH($R63,$A$15:$A$110,0)+14)+INDIRECT(\"$M$\"&MATCH($R63,$A$15:$A$110,0)+15)+INDIRECT(\"$M$\"&MATCH($R63,$A$15:$A$110,0)+16)+INDIRECT(\"$M$\"&MATCH($R63,$A$15:$A$110,0)+17)","v":{"$error":"#N/A"}},{"$f":"INDIRECT(\"$B$\"&MATCH($R63,$A$15:$A$110,0)+14)+INDIRECT(\"$B$\"&MATCH($R63,$A$15:$A$110,0)+15)+INDIRECT(\"$B$\"&MATCH($R63,$A$15:$A$110,0)+16)+INDIRECT(\"$B$\"&MATCH($R63,$A$15:$A$110,0)+17)+INDIRECT(\"$C$\"&MATCH($R63,$A$15:$A$110,0)+14)+INDIRECT(\"$C$\"&MATCH($R63,$A$15:$A$110,0)+15)+INDIRECT(\"$C$\"&MATCH($R63,$A$15:$A$110,0)+16)+INDIRECT(\"$C$\"&MATCH($R63,$A$15:$A$110,0)+17)","v":{"$error":"#N/A"}},{"$f":"INDIRECT(\"$D$\"&MATCH($R63,$A$15:$A$110,0)+14)+INDIRECT(\"$D$\"&MATCH($R63,$A$15:$A$110,0)+15)+INDIRECT(\"$D$\"&MATCH($R63,$A$15:$A$110,0)+16)+INDIRECT(\"$D$\"&MATCH($R63,$A$15:$A$110,0)+17)+INDIRECT(\"$E$\"&MATCH($R63,$A$15:$A$110,0)+14)+INDIRECT(\"$E$\"&MATCH($R63,$A$15:$A$110,0)+15)+INDIRECT(\"$E$\"&MATCH($R63,$A$15:$A$110,0)+16)+INDIRECT(\"$E$\"&MATCH($R63,$A$15:$A$110,0)+17)","v":{"$error":"#N/A"}},{"$f":"INDIRECT(\"$J$\"&MATCH($R63,$A$15:$A$110,0)+14)+INDIRECT(\"$J$\"&MATCH($R63,$A$15:$A$110,0)+15)+INDIRECT(\"$J$\"&MATCH($R63,$A$15:$A$110,0)+16)+INDIRECT(\"$J$\"&MATCH($R63,$A$15:$A$110,0)+17)+INDIRECT(\"$K$\"&MATCH($R63,$A$15:$A$110,0)+14)+INDIRECT(\"$K$\"&MATCH($R63,$A$15:$A$110,0)+15)+INDIRECT(\"$K$\"&MATCH($R63,$A$15:$A$110,0)+16)+INDIRECT(\"$K$\"&MATCH($R63,$A$15:$A$110,0)+17)","v":{"$error":"#N/A"}},{"$f":"R63","v":"6:00 PM"}]
[]
[]
[]
[null,null,null,null,null,null,null,null,null,null,null,null,null,null,null,null,null,"7:00 PM",{"$f":"INDIRECT(\"$L$\"&MATCH($R67,$A$15:$A$110,0)+14)+INDIRECT(\"$L$\"&MATCH($R67,$A$15:$A$110,0)+15)+INDIRECT(\"$L$\"&MATCH($R67,$A$15:$A$110,0)+16)+INDIRECT(\"$L$\"&MATCH($R67,$A$15:$A$110,0)+17)+INDIRECT(\"$M$\"&MATCH($R67,$A$15:$A$110,0)+14)+INDIRECT(\"$M$\"&MATCH($R67,$A$15:$A$110,0)+15)+INDIRECT(\"$M$\"&MATCH($R67,$A$15:$A$110,0)+16)+INDIRECT(\"$M$\"&MATCH($R67,$A$15:$A$110,0)+17)","v":{"$error":"#N/A"}},{"$f":"INDIRECT(\"$B$\"&MATCH($R67,$A$15:$A$110,0)+14)+INDIRECT(\"$B$\"&MATCH($R67,$A$15:$A$110,0)+15)+INDIRECT(\"$B$\"&MATCH($R67,$A$15:$A$110,0)+16)+INDIRECT(\"$B$\"&MATCH($R67,$A$15:$A$110,0)+17)+INDIRECT(\"$C$\"&MATCH($R67,$A$15:$A$110,0)+14)+INDIRECT(\"$C$\"&MATCH($R67,$A$15:$A$110,0)+15)+INDIRECT(\"$C$\"&MATCH($R67,$A$15:$A$110,0)+16)+INDIRECT(\"$C$\"&MATCH($R67,$A$15:$A$110,0)+17)","v":{"$error":"#N/A"}},{"$f":"INDIRECT(\"$D$\"&MATCH($R67,$A$15:$A$110,0)+14)+INDIRECT(\"$D$\"&MATCH($R67,$A$15:$A$110,0)+15)+INDIRECT(\"$D$\"&MATCH($R67,$A$15:$A$110,0)+16)+INDIRECT(\"$D$\"&MATCH($R67,$A$15:$A$110,0)+17)+INDIRECT(\"$E$\"&MATCH($R67,$A$15:$A$110,0)+14)+INDIRECT(\"$E$\"&MATCH($R67,$A$15:$A$110,0)+15)+INDIRECT(\"$E$\"&MATCH($R67,$A$15:$A$110,0)+16)+INDIRECT(\"$E$\"&MATCH($R67,$A$15:$A$110,0)+17)","v":{"$error":"#N/A"}},{"$f":"INDIRECT(\"$J$\"&MATCH($R67,$A$15:$A$110,0)+14)+INDIRECT(\"$J$\"&MATCH($R67,$A$15:$A$110,0)+15)+INDIRECT(\"$J$\"&MATCH($R67,$A$15:$A$110,0)+16)+INDIRECT(\"$J$\"&MATCH($R67,$A$15:$A$110,0)+17)+INDIRECT(\"$K$\"&MATCH($R67,$A$15:$A$110,0)+14)+INDIRECT(\"$K$\"&MATCH($R67,$A$15:$A$110,0)+15)+INDIRECT(\"$K$\"&MATCH($R67,$A$15:$A$110,0)+16)+INDIRECT(\"$K$\"&MATCH($R67,$A$15:$A$110,0)+17)","v":{"$error":"#N/A"}},{"$f":"R67","v":"7:00 PM"}]
[]
[]
[]
[null,null,null,null,null,null,null,null,null,null,null,null,null,null,null,null,null,"8:00 PM",{"$f":"INDIRECT(\"$L$\"&MATCH($R71,$A$15:$A$110,0)+14)+INDIRECT(\"$L$\"&MATCH($R71,$A$15:$A$110,0)+15)+INDIRECT(\"$L$\"&MATCH($R71,$A$15:$A$110,0)+16)+INDIRECT(\"$L$\"&MATCH($R71,$A$15:$A$110,0)+17)+INDIRECT(\"$M$\"&MATCH($R71,$A$15:$A$110,0)+14)+INDIRECT(\"$M$\"&MATCH($R71,$A$15:$A$110,0)+15)+INDIRECT(\"$M$\"&MATCH($R71,$A$15:$A$110,0)+16)+INDIRECT(\"$M$\"&MATCH($R71,$A$15:$A$110,0)+17)","v":{"$error":"#N/A"}},{"$f":"INDIRECT(\"$B$\"&MATCH($R71,$A$15:$A$110,0)+14)+INDIRECT(\"$B$\"&MATCH($R71,$A$15:$A$110,0)+15)+INDIRECT(\"$B$\"&MATCH($R71,$A$15:$A$110,0)+16)+INDIRECT(\"$B$\"&MATCH($R71,$A$15:$A$110,0)+17)+INDIRECT(\"$C$\"&MATCH($R71,$A$15:$A$110,0)+14)+INDIRECT(\"$C$\"&MATCH($R71,$A$15:$A$110,0)+15)+INDIRECT(\"$C$\"&MATCH($R71,$A$15:$A$110,0)+16)+INDIRECT(\"$C$\"&MATCH($R71,$A$15:$A$110,0)+17)","v":{"$error":"#N/A"}},{"$f":"INDIRECT(\"$D$\"&MATCH($R71,$A$15:$A$110,0)+14)+INDIRECT(\"$D$\"&MATCH($R71,$A$15:$A$110,0)+15)+INDIRECT(\"$D$\"&MATCH($R71,$A$15:$A$110,0)+16)+INDIRECT(\"$D$\"&MATCH($R71,$A$15:$A$110,0)+17)+INDIRECT(\"$E$\"&MATCH($R71,$A$15:$A$110,0)+14)+INDIRECT(\"$E$\"&MATCH($R71,$A$15:$A$110,0)+15)+INDIRECT(\"$E$\"&MATCH($R71,$A$15:$A$110,0)+16)+INDIRECT(\"$E$\"&MATCH($R71,$A$15:$A$110,0)+17)","v":{"$error":"#N/A"}},{"$f":"INDIRECT(\"$J$\"&MATCH($R71,$A$15:$A$110,0)+14)+INDIRECT(\"$J$\"&MATCH($R71,$A$15:$A$110,0)+15)+INDIRECT(\"$J$\"&MATCH($R71,$A$15:$A$110,0)+16)+INDIRECT(\"$J$\"&MATCH($R71,$A$15:$A$110,0)+17)+INDIRECT(\"$K$\"&MATCH($R71,$A$15:$A$110,0)+14)+INDIRECT(\"$K$\"&MATCH($R71,$A$15:$A$110,0)+15)+INDIRECT(\"$K$\"&MATCH($R71,$A$15:$A$110,0)+16)+INDIRECT(\"$K$\"&MATCH($R71,$A$15:$A$110,0)+17)","v":{"$error":"#N/A"}},{"$f":"R71","v":"8:00 PM"}]
[]
[]
[]
[null,null,null,null,null,null,null,null,null,null,null,null,null,null,null,null,null,"9:00 PM",{"$f":"INDIRECT(\"$L$\"&MATCH($R75,$A$15:$A$110,0)+14)+INDIRECT(\"$L$\"&MATCH($R75,$A$15:$A$110,0)+15)+INDIRECT(\"$L$\"&MATCH($R75,$A$15:$A$110,0)+16)+INDIRECT(\"$L$\"&MATCH($R75,$A$15:$A$110,0)+17)+INDIRECT(\"$M$\"&MATCH($R75,$A$15:$A$110,0)+14)+INDIRECT(\"$M$\"&MATCH($R75,$A$15:$A$110,0)+15)+INDIRECT(\"$M$\"&MATCH($R75,$A$15:$A$110,0)+16)+INDIRECT(\"$M$\"&MATCH($R75,$A$15:$A$110,0)+17)","v":{"$error":"#N/A"}},{"$f":"INDIRECT(\"$B$\"&MATCH($R75,$A$15:$A$110,0)+14)+INDIRECT(\"$B$\"&MATCH($R75,$A$15:$A$110,0)+15)+INDIRECT(\"$B$\"&MATCH($R75,$A$15:$A$110,0)+16)+INDIRECT(\"$B$\"&MATCH($R75,$A$15:$A$110,0)+17)+INDIRECT(\"$C$\"&MATCH($R75,$A$15:$A$110,0)+14)+INDIRECT(\"$C$\"&MATCH($R75,$A$15:$A$110,0)+15)+INDIRECT(\"$C$\"&MATCH($R75,$A$15:$A$110,0)+16)+INDIRECT(\"$C$\"&MATCH($R75,$A$15:$A$110,0)+17)","v":{"$error":"#N/A"}},{"$f":"INDIRECT(\"$D$\"&MATCH($R75,$A$15:$A$110,0)+14)+INDIRECT(\"$D$\"&MATCH($R75,$A$15:$A$110,0)+15)+INDIRECT(\"$D$\"&MATCH($R75,$A$15:$A$110,0)+16)+INDIRECT(\"$D$\"&MATCH($R75,$A$15:$A$110,0)+17)+INDIRECT(\"$E$\"&MATCH($R75,$A$15:$A$110,0)+14)+INDIRECT(\"$E$\"&MATCH($R75,$A$15:$A$110,0)+15)+INDIRECT(\"$E$\"&MATCH($R75,$A$15:$A$110,0)+16)+INDIRECT(\"$E$\"&MATCH($R75,$A$15:$A$110,0)+17)","v":{"$error":"#N/A"}},{"$f":"INDIRECT(\"$J$\"&MATCH($R75,$A$15:$A$110,0)+14)+INDIRECT(\"$J$\"&MATCH($R75,$A$15:$A$110,0)+15)+INDIRECT(\"$J$\"&MATCH($R75,$A$15:$A$110,0)+16)+INDIRECT(\"$J$\"&MATCH($R75,$A$15:$A$110,0)+17)+INDIRECT(\"$K$\"&MATCH($R75,$A$15:$A$110,0)+14)+INDIRECT(\"$K$\"&MATCH($R75,$A$15:$A$110,0)+15)+INDIRECT(\"$K$\"&MATCH($R75,$A$15:$A$110,0)+16)+INDIRECT(\"$K$\"&MATCH($R75,$A$15:$A$110,0)+17)","v":{"$error":"#N/A"}},{"$f":"R75","v":"9:00 PM"}]
[]
[]
[]
[null,null,null,null,null,null,null,null,null,null,null,null,null,null,null,null,null,"10:00 PM",{"$f":"INDIRECT(\"$L$\"&MATCH($R79,$A$15:$A$110,0)+14)+INDIRECT(\"$L$\"&MATCH($R79,$A$15:$A$110,0)+15)+INDIRECT(\"$L$\"&MATCH($R79,$A$15:$A$110,0)+16)+INDIRECT(\"$L$\"&MATCH($R79,$A$15:$A$110,0)+17)+INDIRECT(\"$M$\"&MATCH($R79,$A$15:$A$110,0)+14)+INDIRECT(\"$M$\"&MATCH($R79,$A$15:$A$110,0)+15)+INDIRECT(\"$M$\"&MATCH($R79,$A$15:$A$110,0)+16)+INDIRECT(\"$M$\"&MATCH($R79,$A$15:$A$110,0)+17)","v":{"$error":"#N/A"}},{"$f":"INDIRECT(\"$B$\"&MATCH($R79,$A$15:$A$110,0)+14)+INDIRECT(\"$B$\"&MATCH($R79,$A$15:$A$110,0)+15)+INDIRECT(\"$B$\"&MATCH($R79,$A$15:$A$110,0)+16)+INDIRECT(\"$B$\"&MATCH($R79,$A$15:$A$110,0)+17)+INDIRECT(\"$C$\"&MATCH($R79,$A$15:$A$110,0)+14)+INDIRECT(\"$C$\"&MATCH($R79,$A$15:$A$110,0)+15)+INDIRECT(\"$C$\"&MATCH($R79,$A$15:$A$110,0)+16)+INDIRECT(\"$C$\"&MATCH($R79,$A$15:$A$110,0)+17)","v":{"$error":"#N/A"}},{"$f":"INDIRECT(\"$D$\"&MATCH($R79,$A$15:$A$110,0)+14)+INDIRECT(\"$D$\"&MATCH($R79,$A$15:$A$110,0)+15)+INDIRECT(\"$D$\"&MATCH($R79,$A$15:$A$110,0)+16)+INDIRECT(\"$D$\"&MATCH($R79,$A$15:$A$110,0)+17)+INDIRECT(\"$E$\"&MATCH($R79,$A$15:$A$110,0)+14)+INDIRECT(\"$E$\"&MATCH($R79,$A$15:$A$110,0)+15)+INDIRECT(\"$E$\"&MATCH($R79,$A$15:$A$110,0)+16)+INDIRECT(\"$E$\"&MATCH($R79,$A$15:$A$110,0)+17)","v":{"$error":"#N/A"}},{"$f":"INDIRECT(\"$J$\"&MATCH($R79,$A$15:$A$110,0)+14)+INDIRECT(\"$J$\"&MATCH($R79,$A$15:$A$110,0)+15)+INDIRECT(\"$J$\"&MATCH($R79,$A$15:$A$110,0)+16)+INDIRECT(\"$J$\"&MATCH($R79,$A$15:$A$110,0)+17)+INDIRECT(\"$K$\"&MATCH($R79,$A$15:$A$110,0)+14)+INDIRECT(\"$K$\"&MATCH($R79,$A$15:$A$110,0)+15)+INDIRECT(\"$K$\"&MATCH($R79,$A$15:$A$110,0)+16)+INDIRECT(\"$K$\"&MATCH($R79,$A$15:$A$110,0)+17)","v":{"$error":"#N/A"}},{"$f":"R79","v":"10:00 PM"}]
[]
[]
[]
[null,null,null,null,null,null,null,null,null,null,null,null,null,null,null,null,null,"11:00 PM",{"$f":"INDIRECT(\"$L$\"&MATCH($R83,$A$15:$A$110,0)+14)+INDIRECT(\"$L$\"&MATCH($R83,$A$15:$A$110,0)+15)+INDIRECT(\"$L$\"&MATCH($R83,$A$15:$A$110,0)+16)+INDIRECT(\"$L$\"&MATCH($R83,$A$15:$A$110,0)+17)+INDIRECT(\"$M$\"&MATCH($R83,$A$15:$A$110,0)+14)+INDIRECT(\"$M$\"&MATCH($R83,$A$15:$A$110,0)+15)+INDIRECT(\"$M$\"&MATCH($R83,$A$15:$A$110,0)+16)+INDIRECT(\"$M$\"&MATCH($R83,$A$15:$A$110,0)+17)","v":{"$error":"#N/A"}},{"$f":"INDIRECT(\"$B$\"&MATCH($R83,$A$15:$A$110,0)+14)+INDIRECT(\"$B$\"&MATCH($R83,$A$15:$A$110,0)+15)+INDIRECT(\"$B$\"&MATCH($R83,$A$15:$A$110,0)+16)+INDIRECT(\"$B$\"&MATCH($R83,$A$15:$A$110,0)+17)+INDIRECT(\"$C$\"&MATCH($R83,$A$15:$A$110,0)+14)+INDIRECT(\"$C$\"&MATCH($R83,$A$15:$A$110,0)+15)+INDIRECT(\"$C$\"&MATCH($R83,$A$15:$A$110,0)+16)+INDIRECT(\"$C$\"&MATCH($R83,$A$15:$A$110,0)+17)","v":{"$error":"#N/A"}},{"$f":"INDIRECT(\"$D$\"&MATCH($R83,$A$15:$A$110,0)+14)+INDIRECT(\"$D$\"&MATCH($R83,$A$15:$A$110,0)+15)+INDIRECT(\"$D$\"&MATCH($R83,$A$15:$A$110,0)+16)+INDIRECT(\"$D$\"&MATCH($R83,$A$15:$A$110,0)+17)+INDIRECT(\"$E$\"&MATCH($R83,$A$15:$A$110,0)+14)+INDIRECT(\"$E$\"&MATCH($R83,$A$15:$A$110,0)+15)+INDIRECT(\"$E$\"&MATCH($R83,$A$15:$A$110,0)+16)+INDIRECT(\"$E$\"&MATCH($R83,$A$15:$A$110,0)+17)","v":{"$error":"#N/A"}},{"$f":"INDIRECT(\"$J$\"&MATCH($R83,$A$15:$A$110,0)+14)+INDIRECT(\"$J$\"&MATCH($R83,$A$15:$A$110,0)+15)+INDIRECT(\"$J$\"&MATCH($R83,$A$15:$A$110,0)+16)+INDIRECT(\"$J$\"&MATCH($R83,$A$15:$A$110,0)+17)+INDIRECT(\"$K$\"&MATCH($R83,$A$15:$A$110,0)+14)+INDIRECT(\"$K$\"&MATCH($R83,$A$15:$A$110,0)+15)+INDIRECT(\"$K$\"&MATCH($R83,$A$15:$A$110,0)+16)+INDIRECT(\"$K$\"&MATCH($R83,$A$15:$A$110,0)+17)","v":{"$error":"#N/A"}},{"$f":"R83","v":"11:00 PM"}]
[]
[]
[]
[null,null,null,null,null,null,null,null,null,null,null,null,null,null,null,null,null,"12:00 AM",{"$f":"INDIRECT(\"$L$\"&MATCH($R87,$A$15:$A$110,0)+14)+INDIRECT(\"$L$\"&MATCH($R87,$A$15:$A$110,0)+15)+INDIRECT(\"$L$\"&MATCH($R87,$A$15:$A$110,0)+16)+INDIRECT(\"$L$\"&MATCH($R87,$A$15:$A$110,0)+17)+INDIRECT(\"$M$\"&MATCH($R87,$A$15:$A$110,0)+14)+INDIRECT(\"$M$\"&MATCH($R87,$A$15:$A$110,0)+15)+INDIRECT(\"$M$\"&MATCH($R87,$A$15:$A$110,0)+16)+INDIRECT(\"$M$\"&MATCH($R87,$A$15:$A$110,0)+17)","v":{"$error":"#N/A"}},{"$f":"INDIRECT(\"$B$\"&MATCH($R87,$A$15:$A$110,0)+14)+INDIRECT(\"$B$\"&MATCH($R87,$A$15:$A$110,0)+15)+INDIRECT(\"$B$\"&MATCH($R87,$A$15:$A$110,0)+16)+INDIRECT(\"$B$\"&MATCH($R87,$A$15:$A$110,0)+17)+INDIRECT(\"$C$\"&MATCH($R87,$A$15:$A$110,0)+14)+INDIRECT(\"$C$\"&MATCH($R87,$A$15:$A$110,0)+15)+INDIRECT(\"$C$\"&MATCH($R87,$A$15:$A$110,0)+16)+INDIRECT(\"$C$\"&MATCH($R87,$A$15:$A$110,0)+17)","v":{"$error":"#N/A"}},{"$f":"INDIRECT(\"$D$\"&MATCH($R87,$A$15:$A$110,0)+14)+INDIRECT(\"$D$\"&MATCH($R87,$A$15:$A$110,0)+15)+INDIRECT(\"$D$\"&MATCH($R87,$A$15:$A$110,0)+16)+INDIRECT(\"$D$\"&MATCH($R87,$A$15:$A$110,0)+17)+INDIRECT(\"$E$\"&MATCH($R87,$A$15:$A$110,0)+14)+INDIRECT(\"$E$\"&MATCH($R87,$A$15:$A$110,0)+15)+INDIRECT(\"$E$\"&MATCH($R87,$A$15:$A$110,0)+16)+INDIRECT(\"$E$\"&MATCH($R87,$A$15:$A$110,0)+17)","v":{"$error":"#N/A"}},{"$f":"INDIRECT(\"$J$\"&MATCH($R87,$A$15:$A$110,0)+14)+INDIRECT(\"$J$\"&MATCH($R87,$A$15:$A$110,0)+15)+INDIRECT(\"$J$\"&MATCH($R87,$A$15:$A$110,0)+16)+INDIRECT(\"$J$\"&MATCH($R87,$A$15:$A$110,0)+17)+INDIRECT(\"$K$\"&MATCH($R87,$A$15:$A$110,0)+14)+INDIRECT(\"$K$\"&MATCH($R87,$A$15:$A$110,0)+15)+INDIRECT(\"$K$\"&MATCH($R87,$A$15:$A$110,0)+16)+INDIRECT(\"$K$\"&MATCH($R87,$A$15:$A$110,0)+17)","v":{"$error":"#N/A"}},{"$f":"R87","v":"12:00 AM"}]
[]
[]
[]
[null,null,null,null,null,null,null,null,null,null,null,null,null,null,null,null,null,"1:00 AM",{"$f":"INDIRECT(\"$L$\"&MATCH($R91,$A$15:$A$110,0)+14)+INDIRECT(\"$L$\"&MATCH($R91,$A$15:$A$110,0)+15)+INDIRECT(\"$L$\"&MATCH($R91,$A$15:$A$110,0)+16)+INDIRECT(\"$L$\"&MATCH($R91,$A$15:$A$110,0)+17)+INDIRECT(\"$M$\"&MATCH($R91,$A$15:$A$110,0)+14)+INDIRECT(\"$M$\"&MATCH($R91,$A$15:$A$110,0)+15)+INDIRECT(\"$M$\"&MATCH($R91,$A$15:$A$110,0)+16)+INDIRECT(\"$M$\"&MATCH($R91,$A$15:$A$110,0)+17)","v":{"$error":"#N/A"}},{"$f":"INDIRECT(\"$B$\"&MATCH($R91,$A$15:$A$110,0)+14)+INDIRECT(\"$B$\"&MATCH($R91,$A$15:$A$110,0)+15)+INDIRECT(\"$B$\"&MATCH($R91,$A$15:$A$110,0)+16)+INDIRECT(\"$B$\"&MATCH($R91,$A$15:$A$110,0)+17)+INDIRECT(\"$C$\"&MATCH($R91,$A$15:$A$110,0)+14)+INDIRECT(\"$C$\"&MATCH($R91,$A$15:$A$110,0)+15)+INDIRECT(\"$C$\"&MATCH($R91,$A$15:$A$110,0)+16)+INDIRECT(\"$C$\"&MATCH($R91,$A$15:$A$110,0)+17)","v":{"$error":"#N/A"}},{"$f":"INDIRECT(\"$D$\"&MATCH($R91,$A$15:$A$110,0)+14)+INDIRECT(\"$D$\"&MATCH($R91,$A$15:$A$110,0)+15)+INDIRECT(\"$D$\"&MATCH($R91,$A$15:$A$110,0)+16)+INDIRECT(\"$D$\"&MATCH($R91,$A$15:$A$110,0)+17)+INDIRECT(\"$E$\"&MATCH($R91,$A$15:$A$110,0)+14)+INDIRECT(\"$E$\"&MATCH($R91,$A$15:$A$110,0)+15)+INDIRECT(\"$E$\"&MATCH($R91,$A$15:$A$110,0)+16)+INDIRECT(\"$E$\"&MATCH($R91,$A$15:$A$110,0)+17)","v":{"$error":"#N/A"}},{"$f":"INDIRECT(\"$J$\"&MATCH($R91,$A$15:$A$110,0)+14)+INDIRECT(\"$J$\"&MATCH($R91,$A$15:$A$110,0)+15)+INDIRECT(\"$J$\"&MATCH($R91,$A$15:$A$110,0)+16)+INDIRECT(\"$J$\"&MATCH($R91,$A$15:$A$110,0)+17)+INDIRECT(\"$K$\"&MATCH($R91,$A$15:$A$110,0)+14)+INDIRECT(\"$K$\"&MATCH($R91,$A$15:$A$110,0)+15)+INDIRECT(\"$K$\"&MATCH($R91,$A$15:$A$110,0)+16)+INDIRECT(\"$K$\"&MATCH($R91,$A$15:$A$110,0)+17)","v":{"$error":"#N/A"}},{"$f":"R91","v":"1:00 AM"}]
[]
[]
[]
[null,null,null,null,null,null,null,null,null,null,null,null,null,null,null,null,null,"2:00 AM",{"$f":"INDIRECT(\"$L$\"&MATCH($R95,$A$15:$A$110,0)+14)+INDIRECT(\"$L$\"&MATCH($R95,$A$15:$A$110,0)+15)+INDIRECT(\"$L$\"&MATCH($R95,$A$15:$A$110,0)+16)+INDIRECT(\"$L$\"&MATCH($R95,$A$15:$A$110,0)+17)+INDIRECT(\"$M$\"&MATCH($R95,$A$15:$A$110,0)+14)+INDIRECT(\"$M$\"&MATCH($R95,$A$15:$A$110,0)+15)+INDIRECT(\"$M$\"&MATCH($R95,$A$15:$A$110,0)+16)+INDIRECT(\"$M$\"&MATCH($R95,$A$15:$A$110,0)+17)","v":{"$error":"#N/A"}},{"$f":"INDIRECT(\"$B$\"&MATCH($R95,$A$15:$A$110,0)+14)+INDIRECT(\"$B$\"&MATCH($R95,$A$15:$A$110,0)+15)+INDIRECT(\"$B$\"&MATCH($R95,$A$15:$A$110,0)+16)+INDIRECT(\"$B$\"&MATCH($R95,$A$15:$A$110,0)+17)+INDIRECT(\"$C$\"&MATCH($R95,$A$15:$A$110,0)+14)+INDIRECT(\"$C$\"&MATCH($R95,$A$15:$A$110,0)+15)+INDIRECT(\"$C$\"&MATCH($R95,$A$15:$A$110,0)+16)+INDIRECT(\"$C$\"&MATCH($R95,$A$15:$A$110,0)+17)","v":{"$error":"#N/A"}},{"$f":"INDIRECT(\"$D$\"&MATCH($R95,$A$15:$A$110,0)+14)+INDIRECT(\"$D$\"&MATCH($R95,$A$15:$A$110,0)+15)+INDIRECT(\"$D$\"&MATCH($R95,$A$15:$A$110,0)+16)+INDIRECT(\"$D$\"&MATCH($R95,$A$15:$A$110,0)+17)+INDIRECT(\"$E$\"&MATCH($R95,$A$15:$A$110,0)+14)+INDIRECT(\"$E$\"&MATCH($R95,$A$15:$A$110,0)+15)+INDIRECT(\"$E$\"&MATCH($R95,$A$15:$A$110,0)+16)+INDIRECT(\"$E$\"&MATCH($R95,$A$15:$A$110,0)+17)","v":{"$error":"#N/A"}},{"$f":"INDIRECT(\"$J$\"&MATCH($R95,$A$15:$A$110,0)+14)+INDIRECT(\"$J$\"&MATCH($R95,$A$15:$A$110,0)+15)+INDIRECT(\"$J$\"&MATCH($R95,$A$15:$A$110,0)+16)+INDIRECT(\"$J$\"&MATCH($R95,$A$15:$A$110,0)+17)+INDIRECT(\"$K$\"&MATCH($R95,$A$15:$A$110,0)+14)+INDIRECT(\"$K$\"&MATCH($R95,$A$15:$A$110,0)+15)+INDIRECT(\"$K$\"&MATCH($R95,$A$15:$A$110,0)+16)+INDIRECT(\"$K$\"&MATCH($R95,$A$15:$A$110,0)+17)","v":{"$error":"#N/A"}},{"$f":"R95","v":"2:00 AM"}]
[]
[]
[]
[null,null,null,null,null,null,null,null,null,null,null,null,null,null,null,null,null,"3:00 AM",{"$f":"INDIRECT(\"$L$\"&MATCH($R99,$A$15:$A$110,0)+14)+INDIRECT(\"$L$\"&MATCH($R99,$A$15:$A$110,0)+15)+INDIRECT(\"$L$\"&MATCH($R99,$A$15:$A$110,0)+16)+INDIRECT(\"$L$\"&MATCH($R99,$A$15:$A$110,0)+17)+INDIRECT(\"$M$\"&MATCH($R99,$A$15:$A$110,0)+14)+INDIRECT(\"$M$\"&MATCH($R99,$A$15:$A$110,0)+15)+INDIRECT(\"$M$\"&MATCH($R99,$A$15:$A$110,0)+16)+INDIRECT(\"$M$\"&MATCH($R99,$A$15:$A$110,0)+17)","v":{"$error":"#N/A"}},{"$f":"INDIRECT(\"$B$\"&MATCH($R99,$A$15:$A$110,0)+14)+INDIRECT(\"$B$\"&MATCH($R99,$A$15:$A$110,0)+15)+INDIRECT(\"$B$\"&MATCH($R99,$A$15:$A$110,0)+16)+INDIRECT(\"$B$\"&MATCH($R99,$A$15:$A$110,0)+17)+INDIRECT(\"$C$\"&MATCH($R99,$A$15:$A$110,0)+14)+INDIRECT(\"$C$\"&MATCH($R99,$A$15:$A$110,0)+15)+INDIRECT(\"$C$\"&MATCH($R99,$A$15:$A$110,0)+16)+INDIRECT(\"$C$\"&MATCH($R99,$A$15:$A$110,0)+17)","v":{"$error":"#N/A"}},{"$f":"INDIRECT(\"$D$\"&MATCH($R99,$A$15:$A$110,0)+14)+INDIRECT(\"$D$\"&MATCH($R99,$A$15:$A$110,0)+15)+INDIRECT(\"$D$\"&MATCH($R99,$A$15:$A$110,0)+16)+INDIRECT(\"$D$\"&MATCH($R99,$A$15:$A$110,0)+17)+INDIRECT(\"$E$\"&MATCH($R99,$A$15:$A$110,0)+14)+INDIRECT(\"$E$\"&MATCH($R99,$A$15:$A$110,0)+15)+INDIRECT(\"$E$\"&MATCH($R99,$A$15:$A$110,0)+16)+INDIRECT(\"$E$\"&MATCH($R99,$A$15:$A$110,0)+17)","v":{"$error":"#N/A"}},{"$f":"INDIRECT(\"$J$\"&MATCH($R99,$A$15:$A$110,0)+14)+INDIRECT(\"$J$\"&MATCH($R99,$A$15:$A$110,0)+15)+INDIRECT(\"$J$\"&MATCH($R99,$A$15:$A$110,0)+16)+INDIRECT(\"$J$\"&MATCH($R99,$A$15:$A$110,0)+17)+INDIRECT(\"$K$\"&MATCH($R99,$A$15:$A$110,0)+14)+INDIRECT(\"$K$\"&MATCH($R99,$A$15:$A$110,0)+15)+INDIRECT(\"$K$\"&MATCH($R99,$A$15:$A$110,0)+16)+INDIRECT(\"$K$\"&MATCH($R99,$A$15:$A$110,0)+17)","v":{"$error":"#N/A"}},{"$f":"R99","v":"3:00 AM"}]
[]
[]
[]
[null,null,null,null,null,null,null,null,null,null,null,null,null,null,null,null,null,"4:00 AM",{"$f":"INDIRECT(\"$L$\"&MATCH($R103,$A$15:$A$110,0)+14)+INDIRECT(\"$L$\"&MATCH($R103,$A$15:$A$110,0)+15)+INDIRECT(\"$L$\"&MATCH($R103,$A$15:$A$110,0)+16)+INDIRECT(\"$L$\"&MATCH($R103,$A$15:$A$110,0)+17)+INDIRECT(\"$M$\"&MATCH($R103,$A$15:$A$110,0)+14)+INDIRECT(\"$M$\"&MATCH($R103,$A$15:$A$110,0)+15)+INDIRECT(\"$M$\"&MATCH($R103,$A$15:$A$110,0)+16)+INDIRECT(\"$M$\"&MATCH($R103,$A$15:$A$110,0)+17)","v":{"$error":"#N/A"}},{"$f":"INDIRECT(\"$B$\"&MATCH($R103,$A$15:$A$110,0)+14)+INDIRECT(\"$B$\"&MATCH($R103,$A$15:$A$110,0)+15)+INDIRECT(\"$B$\"&MATCH($R103,$A$15:$A$110,0)+16)+INDIRECT(\"$B$\"&MATCH($R103,$A$15:$A$110,0)+17)+INDIRECT(\"$C$\"&MATCH($R103,$A$15:$A$110,0)+14)+INDIRECT(\"$C$\"&MATCH($R103,$A$15:$A$110,0)+15)+INDIRECT(\"$C$\"&MATCH($R103,$A$15:$A$110,0)+16)+INDIRECT(\"$C$\"&MATCH($R103,$A$15:$A$110,0)+17)","v":{"$error":"#N/A"}},{"$f":"INDIRECT(\"$D$\"&MATCH($R103,$A$15:$A$110,0)+14)+INDIRECT(\"$D$\"&MATCH($R103,$A$15:$A$110,0)+15)+INDIRECT(\"$D$\"&MATCH($R103,$A$15:$A$110,0)+16)+INDIRECT(\"$D$\"&MATCH($R103,$A$15:$A$110,0)+17)+INDIRECT(\"$E$\"&MATCH($R103,$A$15:$A$110,0)+14)+INDIRECT(\"$E$\"&MATCH($R103,$A$15:$A$110,0)+15)+INDIRECT(\"$E$\"&MATCH($R103,$A$15:$A$110,0)+16)+INDIRECT(\"$E$\"&MATCH($R103,$A$15:$A$110,0)+17)","v":{"$error":"#N/A"}},{"$f":"INDIRECT(\"$J$\"&MATCH($R103,$A$15:$A$110,0)+14)+INDIRECT(\"$J$\"&MATCH($R103,$A$15:$A$110,0)+15)+INDIRECT(\"$J$\"&MATCH($R103,$A$15:$A$110,0)+16)+INDIRECT(\"$J$\"&MATCH($R103,$A$15:$A$110,0)+17)+INDIRECT(\"$K$\"&MATCH($R103,$A$15:$A$110,0)+14)+INDIRECT(\"$K$\"&MATCH($R103,$A$15:$A$110,0)+15)+INDIRECT(\"$K$\"&MATCH($R103,$A$15:$A$110,0)+16)+INDIRECT(\"$K$\"&MATCH($R103,$A$15:$A$110,0)+17)","v":{"$error":"#N/A"}},{"$f":"R103","v":"4:00 AM"}]
[]
[]
[]
[null,null,null,null,null,null,null,null,null,null,null,null,null,null,null,null,null,"5:00 AM",{"$f":"INDIRECT(\"$L$\"&MATCH($R107,$A$15:$A$110,0)+14)+INDIRECT(\"$L$\"&MATCH($R107,$A$15:$A$110,0)+15)+INDIRECT(\"$L$\"&MATCH($R107,$A$15:$A$110,0)+16)+INDIRECT(\"$L$\"&MATCH($R107,$A$15:$A$110,0)+17)+INDIRECT(\"$M$\"&MATCH($R107,$A$15:$A$110,0)+14)+INDIRECT(\"$M$\"&MATCH($R107,$A$15:$A$110,0)+15)+INDIRECT(\"$M$\"&MATCH($R107,$A$15:$A$110,0)+16)+INDIRECT(\"$M$\"&MATCH($R107,$A$15:$A$110,0)+17)","v":{"$error":"#N/A"}},{"$f":"INDIRECT(\"$B$\"&MATCH($R107,$A$15:$A$110,0)+14)+INDIRECT(\"$B$\"&MATCH($R107,$A$15:$A$110,0)+15)+INDIRECT(\"$B$\"&MATCH($R107,$A$15:$A$110,0)+16)+INDIRECT(\"$B$\"&MATCH($R107,$A$15:$A$110,0)+17)+INDIRECT(\"$C$\"&MATCH($R107,$A$15:$A$110,0)+14)+INDIRECT(\"$C$\"&MATCH($R107,$A$15:$A$110,0)+15)+INDIRECT(\"$C$\"&MATCH($R107,$A$15:$A$110,0)+16)+INDIRECT(\"$C$\"&MATCH($R107,$A$15:$A$110,0)+17)","v":{"$error":"#N/A"}},{"$f":"INDIRECT(\"$D$\"&MATCH($R107,$A$15:$A$110,0)+14)+INDIRECT(\"$D$\"&MATCH($R107,$A$15:$A$110,0)+15)+INDIRECT(\"$D$\"&MATCH($R107,$A$15:$A$110,0)+16)+INDIRECT(\"$D$\"&MATCH($R107,$A$15:$A$110,0)+17)+INDIRECT(\"$E$\"&MATCH($R107,$A$15:$A$110,0)+14)+INDIRECT(\"$E$\"&MATCH($R107,$A$15:$A$110,0)+15)+INDIRECT(\"$E$\"&MATCH($R107,$A$15:$A$110,0)+16)+INDIRECT(\"$E$\"&MATCH($R107,$A$15:$A$110,0)+17)","v":{"$error":"#N/A"}},{"$f":"INDIRECT(\"$J$\"&MATCH($R107,$A$15:$A$110,0)+14)+INDIRECT(\"$J$\"&MATCH($R107,$A$15:$A$110,0)+15)+INDIRECT(\"$J$\"&MATCH($R107,$A$15:$A$110,0)+16)+INDIRECT(\"$J$\"&MATCH($R107,$A$15:$A$110,0)+17)+INDIRECT(\"$K$\"&MATCH($R107,$A$15:$A$110,0)+14)+INDIRECT(\"$K$\"&MATCH($R107,$A$15:$A$110,0)+15)+INDIRECT(\"$K$\"&MATCH($R107,$A$15:$A$110,0)+16)+INDIRECT(\"$K$\"&MATCH($R107,$A$15:$A$110,0)+17)","v":{"$error":"#N/A"}},{"$f":"R107","v":"5:00 AM"}]

{"sheet":"N-S Omit RT","index":6,"n_rows":107,"n_cols":23,"rows_kept":107,"cut":false,"hidden":false,"merged":[[12,1,12,4],[12,5,12,8],[12,9,12,12],[12,13,12,16],[12,18,12,22],[9,0,9,1],[9,2,9,16],[10,0,10,1],[10,2,10,16],[11,1,11,4],[11,5,11,8],[11,9,11,12],[11,13,11,16],[6,0,6,1],[6,2,6,16],[7,0,7,1],[7,2,7,16],[8,0,8,1],[8,2,8,16],[3,0,3,1],[3,2,3,16],[4,0,4,1],[4,2,4,16],[5,0,5,1],[5,2,5,16],[0,0,0,1],[0,2,0,16],[1,0,1,1],[1,2,1,16],[2,0,2,1],[2,2,2,16]]}
["Study Name"]
["Start Date"]
["Start Time"]
["Site Code",null,""]
["Project",null,""]
["",null,""]
["",null,""]
["",null,""]
["",null,""]
["Type",null,"Road"]
["Classification",null,"Totals"]
[]
[null,null,null,null,null,null,null,null,null,null,null,null,null,null,null,null,null,null,"Hourly Totals"]
[null,null,null,null,null,null,null,null,null,null,null,null,null,null,null,null,null,null,"NB Left/U-turn","SB Thru","SB Left/U-turn","NB Thru","Start of Hour"]
[null,null,null,null,null,null,null,null,null,null,null,null,null,null,null,null,null,"6:00 AM",{"$f":"INDIRECT(\"$L$\"&MATCH($R15,$A$15:$A$110,0)+14)+INDIRECT(\"$L$\"&MATCH($R15,$A$15:$A$110,0)+15)+INDIRECT(\"$L$\"&MATCH($R15,$A$15:$A$110,0)+16)+INDIRECT(\"$L$\"&MATCH($R15,$A$15:$A$110,0)+17)+INDIRECT(\"$M$\"&MATCH($R15,$A$15:$A$110,0)+14)+INDIRECT(\"$M$\"&MATCH($R15,$A$15:$A$110,0)+15)+INDIRECT(\"$M$\"&MATCH($R15,$A$15:$A$110,0)+16)+INDIRECT(\"$M$\"&MATCH($R15,$A$15:$A$110,0)+17)","v":{"$error":"#N/A"}},{"$f":"INDIRECT(\"$C$\"&MATCH($R15,$A$15:$A$110,0)+14)+INDIRECT(\"$C$\"&MATCH($R15,$A$15:$A$110,0)+15)+INDIRECT(\"$C$\"&MATCH($R15,$A$15:$A$110,0)+16)+INDIRECT(\"$C$\"&MATCH($R15,$A$15:$A$110,0)+17)","v":{"$error":"#N/A"}},{"$f":"INDIRECT(\"$D$\"&MATCH($R15,$A$15:$A$110,0)+14)+INDIRECT(\"$D$\"&MATCH($R15,$A$15:$A$110,0)+15)+INDIRECT(\"$D$\"&MATCH($R15,$A$15:$A$110,0)+16)+INDIRECT(\"$D$\"&MATCH($R15,$A$15:$A$110,0)+17)+INDIRECT(\"$E$\"&MATCH($R15,$A$15:$A$110,0)+14)+INDIRECT(\"$E$\"&MATCH($R15,$A$15:$A$110,0)+15)+INDIRECT(\"$E$\"&MATCH($R15,$A$15:$A$110,0)+16)+INDIRECT(\"$E$\"&MATCH($R15,$A$15:$A$110,0)+17)","v":{"$error":"#N/A"}},{"$f":"INDIRECT(\"$K$\"&MATCH($R15,$A$15:$A$110,0)+14)+INDIRECT(\"$K$\"&MATCH($R15,$A$15:$A$110,0)+15)+INDIRECT(\"$K$\"&MATCH($R15,$A$15:$A$110,0)+16)+INDIRECT(\"$K$\"&MATCH($R15,$A$15:$A$110,0)+17)","v":{"$error":"#N/A"}},{"$f":"R15","v":"6:00 AM"}]
[]
[]
[]
[null,null,null,null,null,null,null,null,null,null,null,null,null,null,null,null,null,"7:00 AM",{"$f":"INDIRECT(\"$L$\"&MATCH($R19,$A$15:$A$110,0)+14)+INDIRECT(\"$L$\"&MATCH($R19,$A$15:$A$110,0)+15)+INDIRECT(\"$L$\"&MATCH($R19,$A$15:$A$110,0)+16)+INDIRECT(\"$L$\"&MATCH($R19,$A$15:$A$110,0)+17)+INDIRECT(\"$M$\"&MATCH($R19,$A$15:$A$110,0)+14)+INDIRECT(\"$M$\"&MATCH($R19,$A$15:$A$110,0)+15)+INDIRECT(\"$M$\"&MATCH($R19,$A$15:$A$110,0)+16)+INDIRECT(\"$M$\"&MATCH($R19,$A$15:$A$110,0)+17)","v":{"$error":"#N/A"}},{"$f":"INDIRECT(\"$C$\"&MATCH($R19,$A$15:$A$110,0)+14)+INDIRECT(\"$C$\"&MATCH($R19,$A$15:$A$110,0)+15)+INDIRECT(\"$C$\"&MATCH($R19,$A$15:$A$110,0)+16)+INDIRECT(\"$C$\"&MATCH($R19,$A$15:$A$110,0)+17)","v":{"$error":"#N/A"}},{"$f":"INDIRECT(\"$D$\"&MATCH($R19,$A$15:$A$110,0)+14)+INDIRECT(\"$D$\"&MATCH($R19,$A$15:$A$110,0)+15)+INDIRECT(\"$D$\"&MATCH($R19,$A$15:$A$110,0)+16)+INDIRECT(\"$D$\"&MATCH($R19,$A$15:$A$110,0)+17)+INDIRECT(\"$E$\"&MATCH($R19,$A$15:$A$110,0)+14)+INDIRECT(\"$E$\"&MATCH($R19,$A$15:$A$110,0)+15)+INDIRECT(\"$E$\"&MATCH($R19,$A$15:$A$110,0)+16)+INDIRECT(\"$E$\"&MATCH($R19,$A$15:$A$110,0)+17)","v":{"$error":"#N/A"}},{"$f":"INDIRECT(\"$K$\"&MATCH($R19,$A$15:$A$110,0)+14)+INDIRECT(\"$K$\"&MATCH($R19,$A$15:$A$110,0)+15)+INDIRECT(\"$K$\"&MATCH($R19,$A$15:$A$110,0)+16)+INDIRECT(\"$K$\"&MATCH($R19,$A$15:$A$110,0)+17)","v":{"$error":"#N/A"}},{"$f":"R19","v":"7:00 AM"}]
[]
[]
[]
[null,null,null,null,null,null,null,null,null,null,null,null,null,null,null,null,null,"8:00 AM",{"$f":"INDIRECT(\"$L$\"&MATCH($R23,$A$15:$A$110,0)+14)+INDIRECT(\"$L$\"&MATCH($R23,$A$15:$A$110,0)+15)+INDIRECT(\"$L$\"&MATCH($R23,$A$15:$A$110,0)+16)+INDIRECT(\"$L$\"&MATCH($R23,$A$15:$A$110,0)+17)+INDIRECT(\"$M$\"&MATCH($R23,$A$15:$A$110,0)+14)+INDIRECT(\"$M$\"&MATCH($R23,$A$15:$A$110,0)+15)+INDIRECT(\"$M$\"&MATCH($R23,$A$15:$A$110,0)+16)+INDIRECT(\"$M$\"&MATCH($R23,$A$15:$A$110,0)+17)","v":{"$error":"#N/A"}},{"$f":"INDIRECT(\"$C$\"&MATCH($R23,$A$15:$A$110,0)+14)+INDIRECT(\"$C$\"&MATCH($R23,$A$15:$A$110,0)+15)+INDIRECT(\"$C$\"&MATCH($R23,$A$15:$A$110,0)+16)+INDIRECT(\"$C$\"&MATCH($R23,$A$15:$A$110,0)+17)","v":{"$error":"#N/A"}},{"$f":"INDIRECT(\"$D$\"&MATCH($R23,$A$15:$A$110,0)+14)+INDIRECT(\"$D$\"&MATCH($R23,$A$15:$A$110,0)+15)+INDIRECT(\"$D$\"&MATCH($R23,$A$15:$A$110,0)+16)+INDIRECT(\"$D$\"&MATCH($R23,$A$15:$A$110,0)+17)+INDIRECT(\"$E$\"&MATCH($R23,$A$15:$A$110,0)+14)+INDIRECT(\"$E$\"&MATCH($R23,$A$15:$A$110,0)+15)+INDIRECT(\"$E$\"&MATCH($R23,$A$15:$A$110,0)+16)+INDIRECT(\"$E$\"&MATCH($R23,$A$15:$A$110,0)+17)","v":{"$error":"#N/A"}},{"$f":"INDIRECT(\"$K$\"&MATCH($R23,$A$15:$A$110,0)+14)+INDIRECT(\"$K$\"&MATCH($R23,$A$15:$A$110,0)+15)+INDIRECT(\"$K$\"&MATCH($R23,$A$15:$A$110,0)+16)+INDIRECT(\"$K$\"&MATCH($R23,$A$15:$A$110,0)+17)","v":{"$error":"#N/A"}},{"$f":"R23","v":"8:00 AM"}]
[]
[]
[]
[null,null,null,null,null,null,null,null,null,null,null,null,null,null,null,null,null,"9:00 AM",{"$f":"INDIRECT(\"$L$\"&MATCH($R27,$A$15:$A$110,0)+14)+INDIRECT(\"$L$\"&MATCH($R27,$A$15:$A$110,0)+15)+INDIRECT(\"$L$\"&MATCH($R27,$A$15:$A$110,0)+16)+INDIRECT(\"$L$\"&MATCH($R27,$A$15:$A$110,0)+17)+INDIRECT(\"$M$\"&MATCH($R27,$A$15:$A$110,0)+14)+INDIRECT(\"$M$\"&MATCH($R27,$A$15:$A$110,0)+15)+INDIRECT(\"$M$\"&MATCH($R27,$A$15:$A$110,0)+16)+INDIRECT(\"$M$\"&MATCH($R27,$A$15:$A$110,0)+17)","v":{"$error":"#N/A"}},{"$f":"INDIRECT(\"$C$\"&MATCH($R27,$A$15:$A$110,0)+14)+INDIRECT(\"$C$\"&MATCH($R27,$A$15:$A$110,0)+15)+INDIRECT(\"$C$\"&MATCH($R27,$A$15:$A$110,0)+16)+INDIRECT(\"$C$\"&MATCH($R27,$A$15:$A$110,0)+17)","v":{"$error":"#N/A"}},{"$f":"INDIRECT(\"$D$\"&MATCH($R27,$A$15:$A$110,0)+14)+INDIRECT(\"$D$\"&MATCH($R27,$A$15:$A$110,0)+15)+INDIRECT(\"$D$\"&MATCH($R27,$A$15:$A$110,0)+16)+INDIRECT(\"$D$\"&MATCH($R27,$A$15:$A$110,0)+17)+INDIRECT(\"$E$\"&MATCH($R27,$A$15:$A$110,0)+14)+INDIRECT(\"$E$\"&MATCH($R27,$A$15:$A$110,0)+15)+INDIRECT(\"$E$\"&MATCH($R27,$A$15:$A$110,0)+16)+INDIRECT(\"$E$\"&MATCH($R27,$A$15:$A$110,0)+17)","v":{"$error":"#N/A"}},{"$f":"INDIRECT(\"$K$\"&MATCH($R27,$A$15:$A$110,0)+14)+INDIRECT(\"$K$\"&MATCH($R27,$A$15:$A$110,0)+15)+INDIRECT(\"$K$\"&MATCH($R27,$A$15:$A$110,0)+16)+INDIRECT(\"$K$\"&MATCH($R27,$A$15:$A$110,0)+17)","v":{"$error":"#N/A"}},{"$f":"R27","v":"9:00 AM"}]
[]
[]
[]
[null,null,null,null,null,null,null,null,null,null,null,null,null,null,null,null,null,"10:00 AM",{"$f":"INDIRECT(\"$L$\"&MATCH($R31,$A$15:$A$110,0)+14)+INDIRECT(\"$L$\"&MATCH($R31,$A$15:$A$110,0)+15)+INDIRECT(\"$L$\"&MATCH($R31,$A$15:$A$110,0)+16)+INDIRECT(\"$L$\"&MATCH($R31,$A$15:$A$110,0)+17)+INDIRECT(\"$M$\"&MATCH($R31,$A$15:$A$110,0)+14)+INDIRECT(\"$M$\"&MATCH($R31,$A$15:$A$110,0)+15)+INDIRECT(\"$M$\"&MATCH($R31,$A$15:$A$110,0)+16)+INDIRECT(\"$M$\"&MATCH($R31,$A$15:$A$110,0)+17)","v":{"$error":"#N/A"}},{"$f":"INDIRECT(\"$C$\"&MATCH($R31,$A$15:$A$110,0)+14)+INDIRECT(\"$C$\"&MATCH($R31,$A$15:$A$110,0)+15)+INDIRECT(\"$C$\"&MATCH($R31,$A$15:$A$110,0)+16)+INDIRECT(\"$C$\"&MATCH($R31,$A$15:$A$110,0)+17)","v":{"$error":"#N/A"}},{"$f":"INDIRECT(\"$D$\"&MATCH($R31,$A$15:$A$110,0)+14)+INDIRECT(\"$D$\"&MATCH($R31,$A$15:$A$110,0)+15)+INDIRECT(\"$D$\"&MATCH($R31,$A$15:$A$110,0)+16)+INDIRECT(\"$D$\"&MATCH($R31,$A$15:$A$110,0)+17)+INDIRECT(\"$E$\"&MATCH($R31,$A$15:$A$110,0)+14)+INDIRECT(\"$E$\"&MATCH($R31,$A$15:$A$110,0)+15)+INDIRECT(\"$E$\"&MATCH($R31,$A$15:$A$110,0)+16)+INDIRECT(\"$E$\"&MATCH($R31,$A$15:$A$110,0)+17)","v":{"$error":"#N/A"}},{"$f":"INDIRECT(\"$K$\"&MATCH($R31,$A$15:$A$110,0)+14)+INDIRECT(\"$K$\"&MATCH($R31,$A$15:$A$110,0)+15)+INDIRECT(\"$K$\"&MATCH($R31,$A$15:$A$110,0)+16)+INDIRECT(\"$K$\"&MATCH($R31,$A$15:$A$110,0)+17)","v":{"$error":"#N/A"}},{"$f":"R31","v":"10:00 AM"}]
[]
[]
[]
[null,null,null,null,null,null,null,null,null,null,null,null,null,null,null,null,null,"11:00 AM",{"$f":"INDIRECT(\"$L$\"&MATCH($R35,$A$15:$A$110,0)+14)+INDIRECT(\"$L$\"&MATCH($R35,$A$15:$A$110,0)+15)+INDIRECT(\"$L$\"&MATCH($R35,$A$15:$A$110,0)+16)+INDIRECT(\"$L$\"&MATCH($R35,$A$15:$A$110,0)+17)+INDIRECT(\"$M$\"&MATCH($R35,$A$15:$A$110,0)+14)+INDIRECT(\"$M$\"&MATCH($R35,$A$15:$A$110,0)+15)+INDIRECT(\"$M$\"&MATCH($R35,$A$15:$A$110,0)+16)+INDIRECT(\"$M$\"&MATCH($R35,$A$15:$A$110,0)+17)","v":{"$error":"#N/A"}},{"$f":"INDIRECT(\"$C$\"&MATCH($R35,$A$15:$A$110,0)+14)+INDIRECT(\"$C$\"&MATCH($R35,$A$15:$A$110,0)+15)+INDIRECT(\"$C$\"&MATCH($R35,$A$15:$A$110,0)+16)+INDIRECT(\"$C$\"&MATCH($R35,$A$15:$A$110,0)+17)","v":{"$error":"#N/A"}},{"$f":"INDIRECT(\"$D$\"&MATCH($R35,$A$15:$A$110,0)+14)+INDIRECT(\"$D$\"&MATCH($R35,$A$15:$A$110,0)+15)+INDIRECT(\"$D$\"&MATCH($R35,$A$15:$A$110,0)+16)+INDIRECT(\"$D$\"&MATCH($R35,$A$15:$A$110,0)+17)+INDIRECT(\"$E$\"&MATCH($R35,$A$15:$A$110,0)+14)+INDIRECT(\"$E$\"&MATCH($R35,$A$15:$A$110,0)+15)+INDIRECT(\"$E$\"&MATCH($R35,$A$15:$A$110,0)+16)+INDIRECT(\"$E$\"&MATCH($R35,$A$15:$A$110,0)+17)","v":{"$error":"#N/A"}},{"$f":"INDIRECT(\"$K$\"&MATCH($R35,$A$15:$A$110,0)+14)+INDIRECT(\"$K$\"&MATCH($R35,$A$15:$A$110,0)+15)+INDIRECT(\"$K$\"&MATCH($R35,$A$15:$A$110,0)+16)+INDIRECT(\"$K$\"&MATCH($R35,$A$15:$A$110,0)+17)","v":{"$error":"#N/A"}},{"$f":"R35","v":"11:00 AM"}]
[]
[]
[]
[null,null,null,null,null,null,null,null,null,null,null,null,null,null,null,null,null,"12:00 PM",{"$f":"INDIRECT(\"$L$\"&MATCH($R39,$A$15:$A$110,0)+14)+INDIRECT(\"$L$\"&MATCH($R39,$A$15:$A$110,0)+15)+INDIRECT(\"$L$\"&MATCH($R39,$A$15:$A$110,0)+16)+INDIRECT(\"$L$\"&MATCH($R39,$A$15:$A$110,0)+17)+INDIRECT(\"$M$\"&MATCH($R39,$A$15:$A$110,0)+14)+INDIRECT(\"$M$\"&MATCH($R39,$A$15:$A$110,0)+15)+INDIRECT(\"$M$\"&MATCH($R39,$A$15:$A$110,0)+16)+INDIRECT(\"$M$\"&MATCH($R39,$A$15:$A$110,0)+17)","v":{"$error":"#N/A"}},{"$f":"INDIRECT(\"$C$\"&MATCH($R39,$A$15:$A$110,0)+14)+INDIRECT(\"$C$\"&MATCH($R39,$A$15:$A$110,0)+15)+INDIRECT(\"$C$\"&MATCH($R39,$A$15:$A$110,0)+16)+INDIRECT(\"$C$\"&MATCH($R39,$A$15:$A$110,0)+17)","v":{"$error":"#N/A"}},{"$f":"INDIRECT(\"$D$\"&MATCH($R39,$A$15:$A$110,0)+14)+INDIRECT(\"$D$\"&MATCH($R39,$A$15:$A$110,0)+15)+INDIRECT(\"$D$\"&MATCH($R39,$A$15:$A$110,0)+16)+INDIRECT(\"$D$\"&MATCH($R39,$A$15:$A$110,0)+17)+INDIRECT(\"$E$\"&MATCH($R39,$A$15:$A$110,0)+14)+INDIRECT(\"$E$\"&MATCH($R39,$A$15:$A$110,0)+15)+INDIRECT(\"$E$\"&MATCH($R39,$A$15:$A$110,0)+16)+INDIRECT(\"$E$\"&MATCH($R39,$A$15:$A$110,0)+17)","v":{"$error":"#N/A"}},{"$f":"INDIRECT(\"$K$\"&MATCH($R39,$A$15:$A$110,0)+14)+INDIRECT(\"$K$\"&MATCH($R39,$A$15:$A$110,0)+15)+INDIRECT(\"$K$\"&MATCH($R39,$A$15:$A$110,0)+16)+INDIRECT(\"$K$\"&MATCH($R39,$A$15:$A$110,0)+17)","v":{"$error":"#N/A"}},{"$f":"R39","v":"12:00 PM"}]
[]
[]
[]
[null,null,null,null,null,null,null,null,null,null,null,null,null,null,null,null,null,"1:00 PM",{"$f":"INDIRECT(\"$L$\"&MATCH($R43,$A$15:$A$110,0)+14)+INDIRECT(\"$L$\"&MATCH($R43,$A$15:$A$110,0)+15)+INDIRECT(\"$L$\"&MATCH($R43,$A$15:$A$110,0)+16)+INDIRECT(\"$L$\"&MATCH($R43,$A$15:$A$110,0)+17)+INDIRECT(\"$M$\"&MATCH($R43,$A$15:$A$110,0)+14)+INDIRECT(\"$M$\"&MATCH($R43,$A$15:$A$110,0)+15)+INDIRECT(\"$M$\"&MATCH($R43,$A$15:$A$110,0)+16)+INDIRECT(\"$M$\"&MATCH($R43,$A$15:$A$110,0)+17)","v":{"$error":"#N/A"}},{"$f":"INDIRECT(\"$C$\"&MATCH($R43,$A$15:$A$110,0)+14)+INDIRECT(\"$C$\"&MATCH($R43,$A$15:$A$110,0)+15)+INDIRECT(\"$C$\"&MATCH($R43,$A$15:$A$110,0)+16)+INDIRECT(\"$C$\"&MATCH($R43,$A$15:$A$110,0)+17)","v":{"$error":"#N/A"}},{"$f":"INDIRECT(\"$D$\"&MATCH($R43,$A$15:$A$110,0)+14)+INDIRECT(\"$D$\"&MATCH($R43,$A$15:$A$110,0)+15)+INDIRECT(\"$D$\"&MATCH($R43,$A$15:$A$110,0)+16)+INDIRECT(\"$D$\"&MATCH($R43,$A$15:$A$110,0)+17)+INDIRECT(\"$E$\"&MATCH($R43,$A$15:$A$110,0)+14)+INDIRECT(\"$E$\"&MATCH($R43,$A$15:$A$110,0)+15)+INDIRECT(\"$E$\"&MATCH($R43,$A$15:$A$110,0)+16)+INDIRECT(\"$E$\"&MATCH($R43,$A$15:$A$110,0)+17)","v":{"$error":"#N/A"}},{"$f":"INDIRECT(\"$K$\"&MATCH($R43,$A$15:$A$110,0)+14)+INDIRECT(\"$K$\"&MATCH($R43,$A$15:$A$110,0)+15)+INDIRECT(\"$K$\"&MATCH($R43,$A$15:$A$110,0)+16)+INDIRECT(\"$K$\"&MATCH($R43,$A$15:$A$110,0)+17)","v":{"$error":"#N/A"}},{"$f":"R43","v":"1:00 PM"}]
[]
[]
[]
[null,null,null,null,null,null,null,null,null,null,null,null,null,null,null,null,null,"2:00 PM",{"$f":"INDIRECT(\"$L$\"&MATCH($R47,$A$15:$A$110,0)+14)+INDIRECT(\"$L$\"&MATCH($R47,$A$15:$A$110,0)+15)+INDIRECT(\"$L$\"&MATCH($R47,$A$15:$A$110,0)+16)+INDIRECT(\"$L$\"&MATCH($R47,$A$15:$A$110,0)+17)+INDIRECT(\"$M$\"&MATCH($R47,$A$15:$A$110,0)+14)+INDIRECT(\"$M$\"&MATCH($R47,$A$15:$A$110,0)+15)+INDIRECT(\"$M$\"&MATCH($R47,$A$15:$A$110,0)+16)+INDIRECT(\"$M$\"&MATCH($R47,$A$15:$A$110,0)+17)","v":{"$error":"#N/A"}},{"$f":"INDIRECT(\"$C$\"&MATCH($R47,$A$15:$A$110,0)+14)+INDIRECT(\"$C$\"&MATCH($R47,$A$15:$A$110,0)+15)+INDIRECT(\"$C$\"&MATCH($R47,$A$15:$A$110,0)+16)+INDIRECT(\"$C$\"&MATCH($R47,$A$15:$A$110,0)+17)","v":{"$error":"#N/A"}},{"$f":"INDIRECT(\"$D$\"&MATCH($R47,$A$15:$A$110,0)+14)+INDIRECT(\"$D$\"&MATCH($R47,$A$15:$A$110,0)+15)+INDIRECT(\"$D$\"&MATCH($R47,$A$15:$A$110,0)+16)+INDIRECT(\"$D$\"&MATCH($R47,$A$15:$A$110,0)+17)+INDIRECT(\"$E$\"&MATCH($R47,$A$15:$A$110,0)+14)+INDIRECT(\"$E$\"&MATCH($R47,$A$15:$A$110,0)+15)+INDIRECT(\"$E$\"&MATCH($R47,$A$15:$A$110,0)+16)+INDIRECT(\"$E$\"&MATCH($R47,$A$15:$A$110,0)+17)","v":{"$error":"#N/A"}},{"$f":"INDIRECT(\"$K$\"&MATCH($R47,$A$15:$A$110,0)+14)+INDIRECT(\"$K$\"&MATCH($R47,$A$15:$A$110,0)+15)+INDIRECT(\"$K$\"&MATCH($R47,$A$15:$A$110,0)+16)+INDIRECT(\"$K$\"&MATCH($R47,$A$15:$A$110,0)+17)","v":{"$error":"#N/A"}},{"$f":"R47","v":"2:00 PM"}]
[]
[]
[]
[null,null,null,null,null,null,null,null,null,null,null,null,null,null,null,null,null,"3:00 PM",{"$f":"INDIRECT(\"$L$\"&MATCH($R51,$A$15:$A$110,0)+14)+INDIRECT(\"$L$\"&MATCH($R51,$A$15:$A$110,0)+15)+INDIRECT(\"$L$\"&MATCH($R51,$A$15:$A$110,0)+16)+INDIRECT(\"$L$\"&MATCH($R51,$A$15:$A$110,0)+17)+INDIRECT(\"$M$\"&MATCH($R51,$A$15:$A$110,0)+14)+INDIRECT(\"$M$\"&MATCH($R51,$A$15:$A$110,0)+15)+INDIRECT(\"$M$\"&MATCH($R51,$A$15:$A$110,0)+16)+INDIRECT(\"$M$\"&MATCH($R51,$A$15:$A$110,0)+17)","v":{"$error":"#N/A"}},{"$f":"INDIRECT(\"$C$\"&MATCH($R51,$A$15:$A$110,0)+14)+INDIRECT(\"$C$\"&MATCH($R51,$A$15:$A$110,0)+15)+INDIRECT(\"$C$\"&MATCH($R51,$A$15:$A$110,0)+16)+INDIRECT(\"$C$\"&MATCH($R51,$A$15:$A$110,0)+17)","v":{"$error":"#N/A"}},{"$f":"INDIRECT(\"$D$\"&MATCH($R51,$A$15:$A$110,0)+14)+INDIRECT(\"$D$\"&MATCH($R51,$A$15:$A$110,0)+15)+INDIRECT(\"$D$\"&MATCH($R51,$A$15:$A$110,0)+16)+INDIRECT(\"$D$\"&MATCH($R51,$A$15:$A$110,0)+17)+INDIRECT(\"$E$\"&MATCH($R51,$A$15:$A$110,0)+14)+INDIRECT(\"$E$\"&MATCH($R51,$A$15:$A$110,0)+15)+INDIRECT(\"$E$\"&MATCH($R51,$A$15:$A$110,0)+16)+INDIRECT(\"$E$\"&MATCH($R51,$A$15:$A$110,0)+17)","v":{"$error":"#N/A"}},{"$f":"INDIRECT(\"$K$\"&MATCH($R51,$A$15:$A$110,0)+14)+INDIRECT(\"$K$\"&MATCH($R51,$A$15:$A$110,0)+15)+INDIRECT(\"$K$\"&MATCH($R51,$A$15:$A$110,0)+16)+INDIRECT(\"$K$\"&MATCH($R51,$A$15:$A$110,0)+17)","v":{"$error":"#N/A"}},{"$f":"R51","v":"3:00 PM"}]
[]
[]
[]
[null,null,null,null,null,null,null,null,null,null,null,null,null,null,null,null,null,"4:00 PM",{"$f":"INDIRECT(\"$L$\"&MATCH($R55,$A$15:$A$110,0)+14)+INDIRECT(\"$L$\"&MATCH($R55,$A$15:$A$110,0)+15)+INDIRECT(\"$L$\"&MATCH($R55,$A$15:$A$110,0)+16)+INDIRECT(\"$L$\"&MATCH($R55,$A$15:$A$110,0)+17)+INDIRECT(\"$M$\"&MATCH($R55,$A$15:$A$110,0)+14)+INDIRECT(\"$M$\"&MATCH($R55,$A$15:$A$110,0)+15)+INDIRECT(\"$M$\"&MATCH($R55,$A$15:$A$110,0)+16)+INDIRECT(\"$M$\"&MATCH($R55,$A$15:$A$110,0)+17)","v":{"$error":"#N/A"}},{"$f":"INDIRECT(\"$C$\"&MATCH($R55,$A$15:$A$110,0)+14)+INDIRECT(\"$C$\"&MATCH($R55,$A$15:$A$110,0)+15)+INDIRECT(\"$C$\"&MATCH($R55,$A$15:$A$110,0)+16)+INDIRECT(\"$C$\"&MATCH($R55,$A$15:$A$110,0)+17)","v":{"$error":"#N/A"}},{"$f":"INDIRECT(\"$D$\"&MATCH($R55,$A$15:$A$110,0)+14)+INDIRECT(\"$D$\"&MATCH($R55,$A$15:$A$110,0)+15)+INDIRECT(\"$D$\"&MATCH($R55,$A$15:$A$110,0)+16)+INDIRECT(\"$D$\"&MATCH($R55,$A$15:$A$110,0)+17)+INDIRECT(\"$E$\"&MATCH($R55,$A$15:$A$110,0)+14)+INDIRECT(\"$E$\"&MATCH($R55,$A$15:$A$110,0)+15)+INDIRECT(\"$E$\"&MATCH($R55,$A$15:$A$110,0)+16)+INDIRECT(\"$E$\"&MATCH($R55,$A$15:$A$110,0)+17)","v":{"$error":"#N/A"}},{"$f":"INDIRECT(\"$K$\"&MATCH($R55,$A$15:$A$110,0)+14)+INDIRECT(\"$K$\"&MATCH($R55,$A$15:$A$110,0)+15)+INDIRECT(\"$K$\"&MATCH($R55,$A$15:$A$110,0)+16)+INDIRECT(\"$K$\"&MATCH($R55,$A$15:$A$110,0)+17)","v":{"$error":"#N/A"}},{"$f":"R55","v":"4:00 PM"}]
[]
[]
[]
[null,null,null,null,null,null,null,null,null,null,null,null,null,null,null,null,null,"5:00 PM",{"$f":"INDIRECT(\"$L$\"&MATCH($R59,$A$15:$A$110,0)+14)+INDIRECT(\"$L$\"&MATCH($R59,$A$15:$A$110,0)+15)+INDIRECT(\"$L$\"&MATCH($R59,$A$15:$A$110,0)+16)+INDIRECT(\"$L$\"&MATCH($R59,$A$15:$A$110,0)+17)+INDIRECT(\"$M$\"&MATCH($R59,$A$15:$A$110,0)+14)+INDIRECT(\"$M$\"&MATCH($R59,$A$15:$A$110,0)+15)+INDIRECT(\"$M$\"&MATCH($R59,$A$15:$A$110,0)+16)+INDIRECT(\"$M$\"&MATCH($R59,$A$15:$A$110,0)+17)","v":{"$error":"#N/A"}},{"$f":"INDIRECT(\"$C$\"&MATCH($R59,$A$15:$A$110,0)+14)+INDIRECT(\"$C$\"&MATCH($R59,$A$15:$A$110,0)+15)+INDIRECT(\"$C$\"&MATCH($R59,$A$15:$A$110,0)+16)+INDIRECT(\"$C$\"&MATCH($R59,$A$15:$A$110,0)+17)","v":{"$error":"#N/A"}},{"$f":"INDIRECT(\"$D$\"&MATCH($R59,$A$15:$A$110,0)+14)+INDIRECT(\"$D$\"&MATCH($R59,$A$15:$A$110,0)+15)+INDIRECT(\"$D$\"&MATCH($R59,$A$15:$A$110,0)+16)+INDIRECT(\"$D$\"&MATCH($R59,$A$15:$A$110,0)+17)+INDIRECT(\"$E$\"&MATCH($R59,$A$15:$A$110,0)+14)+INDIRECT(\"$E$\"&MATCH($R59,$A$15:$A$110,0)+15)+INDIRECT(\"$E$\"&MATCH($R59,$A$15:$A$110,0)+16)+INDIRECT(\"$E$\"&MATCH($R59,$A$15:$A$110,0)+17)","v":{"$error":"#N/A"}},{"$f":"INDIRECT(\"$K$\"&MATCH($R59,$A$15:$A$110,0)+14)+INDIRECT(\"$K$\"&MATCH($R59,$A$15:$A$110,0)+15)+INDIRECT(\"$K$\"&MATCH($R59,$A$15:$A$110,0)+16)+INDIRECT(\"$K$\"&MATCH($R59,$A$15:$A$110,0)+17)","v":{"$error":"#N/A"}},{"$f":"R59","v":"5:00 PM"}]
[]
[]
[]
[null,null,null,null,null,null,null,null,null,null,null,null,null,null,null,null,null,"6:00 PM",{"$f":"INDIRECT(\"$L$\"&MATCH($R63,$A$15:$A$110,0)+14)+INDIRECT(\"$L$\"&MATCH($R63,$A$15:$A$110,0)+15)+INDIRECT(\"$L$\"&MATCH($R63,$A$15:$A$110,0)+16)+INDIRECT(\"$L$\"&MATCH($R63,$A$15:$A$110,0)+17)+INDIRECT(\"$M$\"&MATCH($R63,$A$15:$A$110,0)+14)+INDIRECT(\"$M$\"&MATCH($R63,$A$15:$A$110,0)+15)+INDIRECT(\"$M$\"&MATCH($R63,$A$15:$A$110,0)+16)+INDIRECT(\"$M$\"&MATCH($R63,$A$15:$A$110,0)+17)","v":{"$error":"#N/A"}},{"$f":"INDIRECT(\"$C$\"&MATCH($R63,$A$15:$A$110,0)+14)+INDIRECT(\"$C$\"&MATCH($R63,$A$15:$A$110,0)+15)+INDIRECT(\"$C$\"&MATCH($R63,$A$15:$A$110,0)+16)+INDIRECT(\"$C$\"&MATCH($R63,$A$15:$A$110,0)+17)","v":{"$error":"#N/A"}},{"$f":"INDIRECT(\"$D$\"&MATCH($R63,$A$15:$A$110,0)+14)+INDIRECT(\"$D$\"&MATCH($R63,$A$15:$A$110,0)+15)+INDIRECT(\"$D$\"&MATCH($R63,$A$15:$A$110,0)+16)+INDIRECT(\"$D$\"&MATCH($R63,$A$15:$A$110,0)+17)+INDIRECT(\"$E$\"&MATCH($R63,$A$15:$A$110,0)+14)+INDIRECT(\"$E$\"&MATCH($R63,$A$15:$A$110,0)+15)+INDIRECT(\"$E$\"&MATCH($R63,$A$15:$A$110,0)+16)+INDIRECT(\"$E$\"&MATCH($R63,$A$15:$A$110,0)+17)","v":{"$error":"#N/A"}},{"$f":"INDIRECT(\"$K$\"&MATCH($R63,$A$15:$A$110,0)+14)+INDIRECT(\"$K$\"&MATCH($R63,$A$15:$A$110,0)+15)+INDIRECT(\"$K$\"&MATCH($R63,$A$15:$A$110,0)+16)+INDIRECT(\"$K$\"&MATCH($R63,$A$15:$A$110,0)+17)","v":{"$error":"#N/A"}},{"$f":"R63","v":"6:00 PM"}]
[]
[]
[]
[null,null,null,null,null,null,null,null,null,null,null,null,null,null,null,null,null,"7:00 PM",{"$f":"INDIRECT(\"$L$\"&MATCH($R67,$A$15:$A$110,0)+14)+INDIRECT(\"$L$\"&MATCH($R67,$A$15:$A$110,0)+15)+INDIRECT(\"$L$\"&MATCH($R67,$A$15:$A$110,0)+16)+INDIRECT(\"$L$\"&MATCH($R67,$A$15:$A$110,0)+17)+INDIRECT(\"$M$\"&MATCH($R67,$A$15:$A$110,0)+14)+INDIRECT(\"$M$\"&MATCH($R67,$A$15:$A$110,0)+15)+INDIRECT(\"$M$\"&MATCH($R67,$A$15:$A$110,0)+16)+INDIRECT(\"$M$\"&MATCH($R67,$A$15:$A$110,0)+17)","v":{"$error":"#N/A"}},{"$f":"INDIRECT(\"$C$\"&MATCH($R67,$A$15:$A$110,0)+14)+INDIRECT(\"$C$\"&MATCH($R67,$A$15:$A$110,0)+15)+INDIRECT(\"$C$\"&MATCH($R67,$A$15:$A$110,0)+16)+INDIRECT(\"$C$\"&MATCH($R67,$A$15:$A$110,0)+17)","v":{"$error":"#N/A"}},{"$f":"INDIRECT(\"$D$\"&MATCH($R67,$A$15:$A$110,0)+14)+INDIRECT(\"$D$\"&MATCH($R67,$A$15:$A$110,0)+15)+INDIRECT(\"$D$\"&MATCH($R67,$A$15:$A$110,0)+16)+INDIRECT(\"$D$\"&MATCH($R67,$A$15:$A$110,0)+17)+INDIRECT(\"$E$\"&MATCH($R67,$A$15:$A$110,0)+14)+INDIRECT(\"$E$\"&MATCH($R67,$A$15:$A$110,0)+15)+INDIRECT(\"$E$\"&MATCH($R67,$A$15:$A$110,0)+16)+INDIRECT(\"$E$\"&MATCH($R67,$A$15:$A$110,0)+17)","v":{"$error":"#N/A"}},{"$f":"INDIRECT(\"$K$\"&MATCH($R67,$A$15:$A$110,0)+14)+INDIRECT(\"$K$\"&MATCH($R67,$A$15:$A$110,0)+15)+INDIRECT(\"$K$\"&MATCH($R67,$A$15:$A$110,0)+16)+INDIRECT(\"$K$\"&MATCH($R67,$A$15:$A$110,0)+17)","v":{"$error":"#N/A"}},{"$f":"R67","v":"7:00 PM"}]
[]
[]
[]
[null,null,null,null,null,null,null,null,null,null,null,null,null,null,null,null,null,"8:00 PM",{"$f":"INDIRECT(\"$L$\"&MATCH($R71,$A$15:$A$110,0)+14)+INDIRECT(\"$L$\"&MATCH($R71,$A$15:$A$110,0)+15)+INDIRECT(\"$L$\"&MATCH($R71,$A$15:$A$110,0)+16)+INDIRECT(\"$L$\"&MATCH($R71,$A$15:$A$110,0)+17)+INDIRECT(\"$M$\"&MATCH($R71,$A$15:$A$110,0)+14)+INDIRECT(\"$M$\"&MATCH($R71,$A$15:$A$110,0)+15)+INDIRECT(\"$M$\"&MATCH($R71,$A$15:$A$110,0)+16)+INDIRECT(\"$M$\"&MATCH($R71,$A$15:$A$110,0)+17)","v":{"$error":"#N/A"}},{"$f":"INDIRECT(\"$C$\"&MATCH($R71,$A$15:$A$110,0)+14)+INDIRECT(\"$C$\"&MATCH($R71,$A$15:$A$110,0)+15)+INDIRECT(\"$C$\"&MATCH($R71,$A$15:$A$110,0)+16)+INDIRECT(\"$C$\"&MATCH($R71,$A$15:$A$110,0)+17)","v":{"$error":"#N/A"}},{"$f":"INDIRECT(\"$D$\"&MATCH($R71,$A$15:$A$110,0)+14)+INDIRECT(\"$D$\"&MATCH($R71,$A$15:$A$110,0)+15)+INDIRECT(\"$D$\"&MATCH($R71,$A$15:$A$110,0)+16)+INDIRECT(\"$D$\"&MATCH($R71,$A$15:$A$110,0)+17)+INDIRECT(\"$E$\"&MATCH($R71,$A$15:$A$110,0)+14)+INDIRECT(\"$E$\"&MATCH($R71,$A$15:$A$110,0)+15)+INDIRECT(\"$E$\"&MATCH($R71,$A$15:$A$110,0)+16)+INDIRECT(\"$E$\"&MATCH($R71,$A$15:$A$110,0)+17)","v":{"$error":"#N/A"}},{"$f":"INDIRECT(\"$K$\"&MATCH($R71,$A$15:$A$110,0)+14)+INDIRECT(\"$K$\"&MATCH($R71,$A$15:$A$110,0)+15)+INDIRECT(\"$K$\"&MATCH($R71,$A$15:$A$110,0)+16)+INDIRECT(\"$K$\"&MATCH($R71,$A$15:$A$110,0)+17)","v":{"$error":"#N/A"}},{"$f":"R71","v":"8:00 PM"}]
[]
[]
[]
[null,null,null,null,null,null,null,null,null,null,null,null,null,null,null,null,null,"9:00 PM",{"$f":"INDIRECT(\"$L$\"&MATCH($R75,$A$15:$A$110,0)+14)+INDIRECT(\"$L$\"&MATCH($R75,$A$15:$A$110,0)+15)+INDIRECT(\"$L$\"&MATCH($R75,$A$15:$A$110,0)+16)+INDIRECT(\"$L$\"&MATCH($R75,$A$15:$A$110,0)+17)+INDIRECT(\"$M$\"&MATCH($R75,$A$15:$A$110,0)+14)+INDIRECT(\"$M$\"&MATCH($R75,$A$15:$A$110,0)+15)+INDIRECT(\"$M$\"&MATCH($R75,$A$15:$A$110,0)+16)+INDIRECT(\"$M$\"&MATCH($R75,$A$15:$A$110,0)+17)","v":{"$error":"#N/A"}},{"$f":"INDIRECT(\"$C$\"&MATCH($R75,$A$15:$A$110,0)+14)+INDIRECT(\"$C$\"&MATCH($R75,$A$15:$A$110,0)+15)+INDIRECT(\"$C$\"&MATCH($R75,$A$15:$A$110,0)+16)+INDIRECT(\"$C$\"&MATCH($R75,$A$15:$A$110,0)+17)","v":{"$error":"#N/A"}},{"$f":"INDIRECT(\"$D$\"&MATCH($R75,$A$15:$A$110,0)+14)+INDIRECT(\"$D$\"&MATCH($R75,$A$15:$A$110,0)+15)+INDIRECT(\"$D$\"&MATCH($R75,$A$15:$A$110,0)+16)+INDIRECT(\"$D$\"&MATCH($R75,$A$15:$A$110,0)+17)+INDIRECT(\"$E$\"&MATCH($R75,$A$15:$A$110,0)+14)+INDIRECT(\"$E$\"&MATCH($R75,$A$15:$A$110,0)+15)+INDIRECT(\"$E$\"&MATCH($R75,$A$15:$A$110,0)+16)+INDIRECT(\"$E$\"&MATCH($R75,$A$15:$A$110,0)+17)","v":{"$error":"#N/A"}},{"$f":"INDIRECT(\"$K$\"&MATCH($R75,$A$15:$A$110,0)+14)+INDIRECT(\"$K$\"&MATCH($R75,$A$15:$A$110,0)+15)+INDIRECT(\"$K$\"&MATCH($R75,$A$15:$A$110,0)+16)+INDIRECT(\"$K$\"&MATCH($R75,$A$15:$A$110,0)+17)","v":{"$error":"#N/A"}},{"$f":"R75","v":"9:00 PM"}]
[]
[]
[]
[null,null,null,null,null,null,null,null,null,null,null,null,null,null,null,null,null,"10:00 PM",{"$f":"INDIRECT(\"$L$\"&MATCH($R79,$A$15:$A$110,0)+14)+INDIRECT(\"$L$\"&MATCH($R79,$A$15:$A$110,0)+15)+INDIRECT(\"$L$\"&MATCH($R79,$A$15:$A$110,0)+16)+INDIRECT(\"$L$\"&MATCH($R79,$A$15:$A$110,0)+17)+INDIRECT(\"$M$\"&MATCH($R79,$A$15:$A$110,0)+14)+INDIRECT(\"$M$\"&MATCH($R79,$A$15:$A$110,0)+15)+INDIRECT(\"$M$\"&MATCH($R79,$A$15:$A$110,0)+16)+INDIRECT(\"$M$\"&MATCH($R79,$A$15:$A$110,0)+17)","v":{"$error":"#N/A"}},{"$f":"INDIRECT(\"$C$\"&MATCH($R79,$A$15:$A$110,0)+14)+INDIRECT(\"$C$\"&MATCH($R79,$A$15:$A$110,0)+15)+INDIRECT(\"$C$\"&MATCH($R79,$A$15:$A$110,0)+16)+INDIRECT(\"$C$\"&MATCH($R79,$A$15:$A$110,0)+17)","v":{"$error":"#N/A"}},{"$f":"INDIRECT(\"$D$\"&MATCH($R79,$A$15:$A$110,0)+14)+INDIRECT(\"$D$\"&MATCH($R79,$A$15:$A$110,0)+15)+INDIRECT(\"$D$\"&MATCH($R79,$A$15:$A$110,0)+16)+INDIRECT(\"$D$\"&MATCH($R79,$A$15:$A$110,0)+17)+INDIRECT(\"$E$\"&MATCH($R79,$A$15:$A$110,0)+14)+INDIRECT(\"$E$\"&MATCH($R79,$A$15:$A$110,0)+15)+INDIRECT(\"$E$\"&MATCH($R79,$A$15:$A$110,0)+16)+INDIRECT(\"$E$\"&MATCH($R79,$A$15:$A$110,0)+17)","v":{"$error":"#N/A"}},{"$f":"INDIRECT(\"$K$\"&MATCH($R79,$A$15:$A$110,0)+14)+INDIRECT(\"$K$\"&MATCH($R79,$A$15:$A$110,0)+15)+INDIRECT(\"$K$\"&MATCH($R79,$A$15:$A$110,0)+16)+INDIRECT(\"$K$\"&MATCH($R79,$A$15:$A$110,0)+17)","v":{"$error":"#N/A"}},{"$f":"R79","v":"10:00 PM"}]
[]
[]
[]
[null,null,null,null,null,null,null,null,null,null,null,null,null,null,null,null,null,"11:00 PM",{"$f":"INDIRECT(\"$L$\"&MATCH($R83,$A$15:$A$110,0)+14)+INDIRECT(\"$L$\"&MATCH($R83,$A$15:$A$110,0)+15)+INDIRECT(\"$L$\"&MATCH($R83,$A$15:$A$110,0)+16)+INDIRECT(\"$L$\"&MATCH($R83,$A$15:$A$110,0)+17)+INDIRECT(\"$M$\"&MATCH($R83,$A$15:$A$110,0)+14)+INDIRECT(\"$M$\"&MATCH($R83,$A$15:$A$110,0)+15)+INDIRECT(\"$M$\"&MATCH($R83,$A$15:$A$110,0)+16)+INDIRECT(\"$M$\"&MATCH($R83,$A$15:$A$110,0)+17)","v":{"$error":"#N/A"}},{"$f":"INDIRECT(\"$C$\"&MATCH($R83,$A$15:$A$110,0)+14)+INDIRECT(\"$C$\"&MATCH($R83,$A$15:$A$110,0)+15)+INDIRECT(\"$C$\"&MATCH($R83,$A$15:$A$110,0)+16)+INDIRECT(\"$C$\"&MATCH($R83,$A$15:$A$110,0)+17)","v":{"$error":"#N/A"}},{"$f":"INDIRECT(\"$D$\"&MATCH($R83,$A$15:$A$110,0)+14)+INDIRECT(\"$D$\"&MATCH($R83,$A$15:$A$110,0)+15)+INDIRECT(\"$D$\"&MATCH($R83,$A$15:$A$110,0)+16)+INDIRECT(\"$D$\"&MATCH($R83,$A$15:$A$110,0)+17)+INDIRECT(\"$E$\"&MATCH($R83,$A$15:$A$110,0)+14)+INDIRECT(\"$E$\"&MATCH($R83,$A$15:$A$110,0)+15)+INDIRECT(\"$E$\"&MATCH($R83,$A$15:$A$110,0)+16)+INDIRECT(\"$E$\"&MATCH($R83,$A$15:$A$110,0)+17)","v":{"$error":"#N/A"}},{"$f":"INDIRECT(\"$K$\"&MATCH($R83,$A$15:$A$110,0)+14)+INDIRECT(\"$K$\"&MATCH($R83,$A$15:$A$110,0)+15)+INDIRECT(\"$K$\"&MATCH($R83,$A$15:$A$110,0)+16)+INDIRECT(\"$K$\"&MATCH($R83,$A$15:$A$110,0)+17)","v":{"$error":"#N/A"}},{"$f":"R83","v":"11:00 PM"}]
[]
[]
[]
[null,null,null,null,null,null,null,null,null,null,null,null,null,null,null,null,null,"12:00 AM",{"$f":"INDIRECT(\"$L$\"&MATCH($R87,$A$15:$A$110,0)+14)+INDIRECT(\"$L$\"&MATCH($R87,$A$15:$A$110,0)+15)+INDIRECT(\"$L$\"&MATCH($R87,$A$15:$A$110,0)+16)+INDIRECT(\"$L$\"&MATCH($R87,$A$15:$A$110,0)+17)+INDIRECT(\"$M$\"&MATCH($R87,$A$15:$A$110,0)+14)+INDIRECT(\"$M$\"&MATCH($R87,$A$15:$A$110,0)+15)+INDIRECT(\"$M$\"&MATCH($R87,$A$15:$A$110,0)+16)+INDIRECT(\"$M$\"&MATCH($R87,$A$15:$A$110,0)+17)","v":{"$error":"#N/A"}},{"$f":"INDIRECT(\"$C$\"&MATCH($R87,$A$15:$A$110,0)+14)+INDIRECT(\"$C$\"&MATCH($R87,$A$15:$A$110,0)+15)+INDIRECT(\"$C$\"&MATCH($R87,$A$15:$A$110,0)+16)+INDIRECT(\"$C$\"&MATCH($R87,$A$15:$A$110,0)+17)","v":{"$error":"#N/A"}},{"$f":"INDIRECT(\"$D$\"&MATCH($R87,$A$15:$A$110,0)+14)+INDIRECT(\"$D$\"&MATCH($R87,$A$15:$A$110,0)+15)+INDIRECT(\"$D$\"&MATCH($R87,$A$15:$A$110,0)+16)+INDIRECT(\"$D$\"&MATCH($R87,$A$15:$A$110,0)+17)+INDIRECT(\"$E$\"&MATCH($R87,$A$15:$A$110,0)+14)+INDIRECT(\"$E$\"&MATCH($R87,$A$15:$A$110,0)+15)+INDIRECT(\"$E$\"&MATCH($R87,$A$15:$A$110,0)+16)+INDIRECT(\"$E$\"&MATCH($R87,$A$15:$A$110,0)+17)","v":{"$error":"#N/A"}},{"$f":"INDIRECT(\"$K$\"&MATCH($R87,$A$15:$A$110,0)+14)+INDIRECT(\"$K$\"&MATCH($R87,$A$15:$A$110,0)+15)+INDIRECT(\"$K$\"&MATCH($R87,$A$15:$A$110,0)+16)+INDIRECT(\"$K$\"&MATCH($R87,$A$15:$A$110,0)+17)","v":{"$error":"#N/A"}},{"$f":"R87","v":"12:00 AM"}]
[]
[]
[]
[null,null,null,null,null,null,null,null,null,null,null,null,null,null,null,null,null,"1:00 AM",{"$f":"INDIRECT(\"$L$\"&MATCH($R91,$A$15:$A$110,0)+14)+INDIRECT(\"$L$\"&MATCH($R91,$A$15:$A$110,0)+15)+INDIRECT(\"$L$\"&MATCH($R91,$A$15:$A$110,0)+16)+INDIRECT(\"$L$\"&MATCH($R91,$A$15:$A$110,0)+17)+INDIRECT(\"$M$\"&MATCH($R91,$A$15:$A$110,0)+14)+INDIRECT(\"$M$\"&MATCH($R91,$A$15:$A$110,0)+15)+INDIRECT(\"$M$\"&MATCH($R91,$A$15:$A$110,0)+16)+INDIRECT(\"$M$\"&MATCH($R91,$A$15:$A$110,0)+17)","v":{"$error":"#N/A"}},{"$f":"INDIRECT(\"$C$\"&MATCH($R91,$A$15:$A$110,0)+14)+INDIRECT(\"$C$\"&MATCH($R91,$A$15:$A$110,0)+15)+INDIRECT(\"$C$\"&MATCH($R91,$A$15:$A$110,0)+16)+INDIRECT(\"$C$\"&MATCH($R91,$A$15:$A$110,0)+17)","v":{"$error":"#N/A"}},{"$f":"INDIRECT(\"$D$\"&MATCH($R91,$A$15:$A$110,0)+14)+INDIRECT(\"$D$\"&MATCH($R91,$A$15:$A$110,0)+15)+INDIRECT(\"$D$\"&MATCH($R91,$A$15:$A$110,0)+16)+INDIRECT(\"$D$\"&MATCH($R91,$A$15:$A$110,0)+17)+INDIRECT(\"$E$\"&MATCH($R91,$A$15:$A$110,0)+14)+INDIRECT(\"$E$\"&MATCH($R91,$A$15:$A$110,0)+15)+INDIRECT(\"$E$\"&MATCH($R91,$A$15:$A$110,0)+16)+INDIRECT(\"$E$\"&MATCH($R91,$A$15:$A$110,0)+17)","v":{"$error":"#N/A"}},{"$f":"INDIRECT(\"$K$\"&MATCH($R91,$A$15:$A$110,0)+14)+INDIRECT(\"$K$\"&MATCH($R91,$A$15:$A$110,0)+15)+INDIRECT(\"$K$\"&MATCH($R91,$A$15:$A$110,0)+16)+INDIRECT(\"$K$\"&MATCH($R91,$A$15:$A$110,0)+17)","v":{"$error":"#N/A"}},{"$f":"R91","v":"1:00 AM"}]
[]
[]
[]
[null,null,null,null,null,null,null,null,null,null,null,null,null,null,null,null,null,"2:00 AM",{"$f":"INDIRECT(\"$L$\"&MATCH($R95,$A$15:$A$110,0)+14)+INDIRECT(\"$L$\"&MATCH($R95,$A$15:$A$110,0)+15)+INDIRECT(\"$L$\"&MATCH($R95,$A$15:$A$110,0)+16)+INDIRECT(\"$L$\"&MATCH($R95,$A$15:$A$110,0)+17)+INDIRECT(\"$M$\"&MATCH($R95,$A$15:$A$110,0)+14)+INDIRECT(\"$M$\"&MATCH($R95,$A$15:$A$110,0)+15)+INDIRECT(\"$M$\"&MATCH($R95,$A$15:$A$110,0)+16)+INDIRECT(\"$M$\"&MATCH($R95,$A$15:$A$110,0)+17)","v":{"$error":"#N/A"}},{"$f":"INDIRECT(\"$C$\"&MATCH($R95,$A$15:$A$110,0)+14)+INDIRECT(\"$C$\"&MATCH($R95,$A$15:$A$110,0)+15)+INDIRECT(\"$C$\"&MATCH($R95,$A$15:$A$110,0)+16)+INDIRECT(\"$C$\"&MATCH($R95,$A$15:$A$110,0)+17)","v":{"$error":"#N/A"}},{"$f":"INDIRECT(\"$D$\"&MATCH($R95,$A$15:$A$110,0)+14)+INDIRECT(\"$D$\"&MATCH($R95,$A$15:$A$110,0)+15)+INDIRECT(\"$D$\"&MATCH($R95,$A$15:$A$110,0)+16)+INDIRECT(\"$D$\"&MATCH($R95,$A$15:$A$110,0)+17)+INDIRECT(\"$E$\"&MATCH($R95,$A$15:$A$110,0)+14)+INDIRECT(\"$E$\"&MATCH($R95,$A$15:$A$110,0)+15)+INDIRECT(\"$E$\"&MATCH($R95,$A$15:$A$110,0)+16)+INDIRECT(\"$E$\"&MATCH($R95,$A$15:$A$110,0)+17)","v":{"$error":"#N/A"}},{"$f":"INDIRECT(\"$K$\"&MATCH($R95,$A$15:$A$110,0)+14)+INDIRECT(\"$K$\"&MATCH($R95,$A$15:$A$110,0)+15)+INDIRECT(\"$K$\"&MATCH($R95,$A$15:$A$110,0)+16)+INDIRECT(\"$K$\"&MATCH($R95,$A$15:$A$110,0)+17)","v":{"$error":"#N/A"}},{"$f":"R95","v":"2:00 AM"}]
[]
[]
[]
[null,null,null,null,null,null,null,null,null,null,null,null,null,null,null,null,null,"3:00 AM",{"$f":"INDIRECT(\"$L$\"&MATCH($R99,$A$15:$A$110,0)+14)+INDIRECT(\"$L$\"&MATCH($R99,$A$15:$A$110,0)+15)+INDIRECT(\"$L$\"&MATCH($R99,$A$15:$A$110,0)+16)+INDIRECT(\"$L$\"&MATCH($R99,$A$15:$A$110,0)+17)+INDIRECT(\"$M$\"&MATCH($R99,$A$15:$A$110,0)+14)+INDIRECT(\"$M$\"&MATCH($R99,$A$15:$A$110,0)+15)+INDIRECT(\"$M$\"&MATCH($R99,$A$15:$A$110,0)+16)+INDIRECT(\"$M$\"&MATCH($R99,$A$15:$A$110,0)+17)","v":{"$error":"#N/A"}},{"$f":"INDIRECT(\"$C$\"&MATCH($R99,$A$15:$A$110,0)+14)+INDIRECT(\"$C$\"&MATCH($R99,$A$15:$A$110,0)+15)+INDIRECT(\"$C$\"&MATCH($R99,$A$15:$A$110,0)+16)+INDIRECT(\"$C$\"&MATCH($R99,$A$15:$A$110,0)+17)","v":{"$error":"#N/A"}},{"$f":"INDIRECT(\"$D$\"&MATCH($R99,$A$15:$A$110,0)+14)+INDIRECT(\"$D$\"&MATCH($R99,$A$15:$A$110,0)+15)+INDIRECT(\"$D$\"&MATCH($R99,$A$15:$A$110,0)+16)+INDIRECT(\"$D$\"&MATCH($R99,$A$15:$A$110,0)+17)+INDIRECT(\"$E$\"&MATCH($R99,$A$15:$A$110,0)+14)+INDIRECT(\"$E$\"&MATCH($R99,$A$15:$A$110,0)+15)+INDIRECT(\"$E$\"&MATCH($R99,$A$15:$A$110,0)+16)+INDIRECT(\"$E$\"&MATCH($R99,$A$15:$A$110,0)+17)","v":{"$error":"#N/A"}},{"$f":"INDIRECT(\"$K$\"&MATCH($R99,$A$15:$A$110,0)+14)+INDIRECT(\"$K$\"&MATCH($R99,$A$15:$A$110,0)+15)+INDIRECT(\"$K$\"&MATCH($R99,$A$15:$A$110,0)+16)+INDIRECT(\"$K$\"&MATCH($R99,$A$15:$A$110,0)+17)","v":{"$error":"#N/A"}},{"$f":"R99","v":"3:00 AM"}]
[]
[]
[]
[null,null,null,null,null,null,null,null,null,null,null,null,null,null,null,null,null,"4:00 AM",{"$f":"INDIRECT(\"$L$\"&MATCH($R103,$A$15:$A$110,0)+14)+INDIRECT(\"$L$\"&MATCH($R103,$A$15:$A$110,0)+15)+INDIRECT(\"$L$\"&MATCH($R103,$A$15:$A$110,0)+16)+INDIRECT(\"$L$\"&MATCH($R103,$A$15:$A$110,0)+17)+INDIRECT(\"$M$\"&MATCH($R103,$A$15:$A$110,0)+14)+INDIRECT(\"$M$\"&MATCH($R103,$A$15:$A$110,0)+15)+INDIRECT(\"$M$\"&MATCH($R103,$A$15:$A$110,0)+16)+INDIRECT(\"$M$\"&MATCH($R103,$A$15:$A$110,0)+17)","v":{"$error":"#N/A"}},{"$f":"INDIRECT(\"$C$\"&MATCH($R103,$A$15:$A$110,0)+14)+INDIRECT(\"$C$\"&MATCH($R103,$A$15:$A$110,0)+15)+INDIRECT(\"$C$\"&MATCH($R103,$A$15:$A$110,0)+16)+INDIRECT(\"$C$\"&MATCH($R103,$A$15:$A$110,0)+17)","v":{"$error":"#N/A"}},{"$f":"INDIRECT(\"$D$\"&MATCH($R103,$A$15:$A$110,0)+14)+INDIRECT(\"$D$\"&MATCH($R103,$A$15:$A$110,0)+15)+INDIRECT(\"$D$\"&MATCH($R103,$A$15:$A$110,0)+16)+INDIRECT(\"$D$\"&MATCH($R103,$A$15:$A$110,0)+17)+INDIRECT(\"$E$\"&MATCH($R103,$A$15:$A$110,0)+14)+INDIRECT(\"$E$\"&MATCH($R103,$A$15:$A$110,0)+15)+INDIRECT(\"$E$\"&MATCH($R103,$A$15:$A$110,0)+16)+INDIRECT(\"$E$\"&MATCH($R103,$A$15:$A$110,0)+17)","v":{"$error":"#N/A"}},{"$f":"INDIRECT(\"$K$\"&MATCH($R103,$A$15:$A$110,0)+14)+INDIRECT(\"$K$\"&MATCH($R103,$A$15:$A$110,0)+15)+INDIRECT(\"$K$\"&MATCH($R103,$A$15:$A$110,0)+16)+INDIRECT(\"$K$\"&MATCH($R103,$A$15:$A$110,0)+17)","v":{"$error":"#N/A"}},{"$f":"R103","v":"4:00 AM"}]
[]
[]
[]
[null,null,null,null,null,null,null,null,null,null,null,null,null,null,null,null,null,"5:00 AM",{"$f":"INDIRECT(\"$L$\"&MATCH($R107,$A$15:$A$110,0)+14)+INDIRECT(\"$L$\"&MATCH($R107,$A$15:$A$110,0)+15)+INDIRECT(\"$L$\"&MATCH($R107,$A$15:$A$110,0)+16)+INDIRECT(\"$L$\"&MATCH($R107,$A$15:$A$110,0)+17)+INDIRECT(\"$M$\"&MATCH($R107,$A$15:$A$110,0)+14)+INDIRECT(\"$M$\"&MATCH($R107,$A$15:$A$110,0)+15)+INDIRECT(\"$M$\"&MATCH($R107,$A$15:$A$110,0)+16)+INDIRECT(\"$M$\"&MATCH($R107,$A$15:$A$110,0)+17)","v":{"$error":"#N/A"}},{"$f":"INDIRECT(\"$C$\"&MATCH($R107,$A$15:$A$110,0)+14)+INDIRECT(\"$C$\"&MATCH($R107,$A$15:$A$110,0)+15)+INDIRECT(\"$C$\"&MATCH($R107,$A$15:$A$110,0)+16)+INDIRECT(\"$C$\"&MATCH($R107,$A$15:$A$110,0)+17)","v":{"$error":"#N/A"}},{"$f":"INDIRECT(\"$D$\"&MATCH($R107,$A$15:$A$110,0)+14)+INDIRECT(\"$D$\"&MATCH($R107,$A$15:$A$110,0)+15)+INDIRECT(\"$D$\"&MATCH($R107,$A$15:$A$110,0)+16)+INDIRECT(\"$D$\"&MATCH($R107,$A$15:$A$110,0)+17)+INDIRECT(\"$E$\"&MATCH($R107,$A$15:$A$110,0)+14)+INDIRECT(\"$E$\"&MATCH($R107,$A$15:$A$110,0)+15)+INDIRECT(\"$E$\"&MATCH($R107,$A$15:$A$110,0)+16)+INDIRECT(\"$E$\"&MATCH($R107,$A$15:$A$110,0)+17)","v":{"$error":"#N/A"}},{"$f":"INDIRECT(\"$K$\"&MATCH($R107,$A$15:$A$110,0)+14)+INDIRECT(\"$K$\"&MATCH($R107,$A$15:$A$110,0)+15)+INDIRECT(\"$K$\"&MATCH($R107,$A$15:$A$110,0)+16)+INDIRECT(\"$K$\"&MATCH($R107,$A$15:$A$110,0)+17)","v":{"$error":"#N/A"}},{"$f":"R107","v":"5:00 AM"}]

{"sheet":"N-S Formatted","index":7,"n_rows":0,"n_cols":0,"rows_kept":0,"cut":false,"hidden":false,"merged":[]}

{"sheet":"E-W","index":8,"n_rows":107,"n_cols":23,"rows_kept":107,"cut":false,"hidden":false,"merged":[[12,1,12,4],[12,5,12,8],[12,9,12,12],[12,13,12,16],[12,18,12,22],[9,0,9,1],[9,2,9,16],[10,0,10,1],[10,2,10,16],[11,1,11,4],[11,5,11,8],[11,9,11,12],[11,13,11,16],[6,0,6,1],[6,2,6,16],[7,0,7,1],[7,2,7,16],[8,0,8,1],[8,2,8,16],[3,0,3,1],[3,2,3,16],[4,0,4,1],[4,2,4,16],[5,0,5,1],[5,2,5,16],[0,0,0,1],[0,2,0,16],[1,0,1,1],[1,2,1,16],[2,0,2,1],[2,2,2,16]]}
["Study Name"]
["Start Date"]
["Start Time"]
["Site Code",null,""]
["Project",null,""]
["",null,""]
["",null,""]
["",null,""]
["",null,""]
["Type",null,"Road"]
["Classification",null,"Totals"]
[]
[null,null,null,null,null,null,null,null,null,null,null,null,null,null,null,null,null,null,"Hourly Totals"]
[null,null,null,null,null,null,null,null,null,null,null,null,null,null,null,null,null,null,"EB Left/U-turn","WB Thru/Right","WB Left/U-turn","EB Thru/Right","Start of Hour"]
[null,null,null,null,null,null,null,null,null,null,null,null,null,null,null,null,null,"6:00 AM",{"$f":"INDIRECT(\"$P$\"&MATCH($R15,$A$15:$A$110,0)+14)+INDIRECT(\"$P$\"&MATCH($R15,$A$15:$A$110,0)+15)+INDIRECT(\"$P$\"&MATCH($R15,$A$15:$A$110,0)+16)+INDIRECT(\"$P$\"&MATCH($R15,$A$15:$A$110,0)+17)+INDIRECT(\"$Q$\"&MATCH($R15,$A$15:$A$110,0)+14)+INDIRECT(\"$Q$\"&MATCH($R15,$A$15:$A$110,0)+15)+INDIRECT(\"$Q$\"&MATCH($R15,$A$15:$A$110,0)+16)+INDIRECT(\"$Q$\"&MATCH($R15,$A$15:$A$110,0)+17)","v":{"$error":"#N/A"}},{"$f":"INDIRECT(\"$F$\"&MATCH($R15,$A$15:$A$110,0)+14)+INDIRECT(\"$F$\"&MATCH($R15,$A$15:$A$110,0)+15)+INDIRECT(\"$F$\"&MATCH($R15,$A$15:$A$110,0)+16)+INDIRECT(\"$F$\"&MATCH($R15,$A$15:$A$110,0)+17)+INDIRECT(\"$G$\"&MATCH($R15,$A$15:$A$110,0)+14)+INDIRECT(\"$G$\"&MATCH($R15,$A$15:$A$110,0)+15)+INDIRECT(\"$G$\"&MATCH($R15,$A$15:$A$110,0)+16)+INDIRECT(\"$G$\"&MATCH($R15,$A$15:$A$110,0)+17)","v":{"$error":"#N/A"}},{"$f":"INDIRECT(\"$H$\"&MATCH($R15,$A$15:$A$110,0)+14)+INDIRECT(\"$H$\"&MATCH($R15,$A$15:$A$110,0)+15)+INDIRECT(\"$H$\"&MATCH($R15,$A$15:$A$110,0)+16)+INDIRECT(\"$H$\"&MATCH($R15,$A$15:$A$110,0)+17)+INDIRECT(\"$I$\"&MATCH($R15,$A$15:$A$110,0)+14)+INDIRECT(\"$I$\"&MATCH($R15,$A$15:$A$110,0)+15)+INDIRECT(\"$I$\"&MATCH($R15,$A$15:$A$110,0)+16)+INDIRECT(\"$I$\"&MATCH($R15,$A$15:$A$110,0)+17)","v":{"$error":"#N/A"}},{"$f":"INDIRECT(\"$N$\"&MATCH($R15,$A$15:$A$110,0)+14)+INDIRECT(\"$N$\"&MATCH($R15,$A$15:$A$110,0)+15)+INDIRECT(\"$N$\"&MATCH($R15,$A$15:$A$110,0)+16)+INDIRECT(\"$N$\"&MATCH($R15,$A$15:$A$110,0)+17)+INDIRECT(\"$O$\"&MATCH($R15,$A$15:$A$110,0)+14)+INDIRECT(\"$O$\"&MATCH($R15,$A$15:$A$110,0)+15)+INDIRECT(\"$O$\"&MATCH($R15,$A$15:$A$110,0)+16)+INDIRECT(\"$O$\"&MATCH($R15,$A$15:$A$110,0)+17)","v":{"$error":"#N/A"}},{"$f":"R15","v":"6:00 AM"}]
[]
[]
[]
[null,null,null,null,null,null,null,null,null,null,null,null,null,null,null,null,null,"7:00 AM",{"$f":"INDIRECT(\"$P$\"&MATCH($R19,$A$15:$A$110,0)+14)+INDIRECT(\"$P$\"&MATCH($R19,$A$15:$A$110,0)+15)+INDIRECT(\"$P$\"&MATCH($R19,$A$15:$A$110,0)+16)+INDIRECT(\"$P$\"&MATCH($R19,$A$15:$A$110,0)+17)+INDIRECT(\"$Q$\"&MATCH($R19,$A$15:$A$110,0)+14)+INDIRECT(\"$Q$\"&MATCH($R19,$A$15:$A$110,0)+15)+INDIRECT(\"$Q$\"&MATCH($R19,$A$15:$A$110,0)+16)+INDIRECT(\"$Q$\"&MATCH($R19,$A$15:$A$110,0)+17)","v":{"$error":"#N/A"}},{"$f":"INDIRECT(\"$F$\"&MATCH($R19,$A$15:$A$110,0)+14)+INDIRECT(\"$F$\"&MATCH($R19,$A$15:$A$110,0)+15)+INDIRECT(\"$F$\"&MATCH($R19,$A$15:$A$110,0)+16)+INDIRECT(\"$F$\"&MATCH($R19,$A$15:$A$110,0)+17)+INDIRECT(\"$G$\"&MATCH($R19,$A$15:$A$110,0)+14)+INDIRECT(\"$G$\"&MATCH($R19,$A$15:$A$110,0)+15)+INDIRECT(\"$G$\"&MATCH($R19,$A$15:$A$110,0)+16)+INDIRECT(\"$G$\"&MATCH($R19,$A$15:$A$110,0)+17)","v":{"$error":"#N/A"}},{"$f":"INDIRECT(\"$H$\"&MATCH($R19,$A$15:$A$110,0)+14)+INDIRECT(\"$H$\"&MATCH($R19,$A$15:$A$110,0)+15)+INDIRECT(\"$H$\"&MATCH($R19,$A$15:$A$110,0)+16)+INDIRECT(\"$H$\"&MATCH($R19,$A$15:$A$110,0)+17)+INDIRECT(\"$I$\"&MATCH($R19,$A$15:$A$110,0)+14)+INDIRECT(\"$I$\"&MATCH($R19,$A$15:$A$110,0)+15)+INDIRECT(\"$I$\"&MATCH($R19,$A$15:$A$110,0)+16)+INDIRECT(\"$I$\"&MATCH($R19,$A$15:$A$110,0)+17)","v":{"$error":"#N/A"}},{"$f":"INDIRECT(\"$N$\"&MATCH($R19,$A$15:$A$110,0)+14)+INDIRECT(\"$N$\"&MATCH($R19,$A$15:$A$110,0)+15)+INDIRECT(\"$N$\"&MATCH($R19,$A$15:$A$110,0)+16)+INDIRECT(\"$N$\"&MATCH($R19,$A$15:$A$110,0)+17)+INDIRECT(\"$O$\"&MATCH($R19,$A$15:$A$110,0)+14)+INDIRECT(\"$O$\"&MATCH($R19,$A$15:$A$110,0)+15)+INDIRECT(\"$O$\"&MATCH($R19,$A$15:$A$110,0)+16)+INDIRECT(\"$O$\"&MATCH($R19,$A$15:$A$110,0)+17)","v":{"$error":"#N/A"}},{"$f":"R19","v":"7:00 AM"}]
[]
[]
[]
[null,null,null,null,null,null,null,null,null,null,null,null,null,null,null,null,null,"8:00 AM",{"$f":"INDIRECT(\"$P$\"&MATCH($R23,$A$15:$A$110,0)+14)+INDIRECT(\"$P$\"&MATCH($R23,$A$15:$A$110,0)+15)+INDIRECT(\"$P$\"&MATCH($R23,$A$15:$A$110,0)+16)+INDIRECT(\"$P$\"&MATCH($R23,$A$15:$A$110,0)+17)+INDIRECT(\"$Q$\"&MATCH($R23,$A$15:$A$110,0)+14)+INDIRECT(\"$Q$\"&MATCH($R23,$A$15:$A$110,0)+15)+INDIRECT(\"$Q$\"&MATCH($R23,$A$15:$A$110,0)+16)+INDIRECT(\"$Q$\"&MATCH($R23,$A$15:$A$110,0)+17)","v":{"$error":"#N/A"}},{"$f":"INDIRECT(\"$F$\"&MATCH($R23,$A$15:$A$110,0)+14)+INDIRECT(\"$F$\"&MATCH($R23,$A$15:$A$110,0)+15)+INDIRECT(\"$F$\"&MATCH($R23,$A$15:$A$110,0)+16)+INDIRECT(\"$F$\"&MATCH($R23,$A$15:$A$110,0)+17)+INDIRECT(\"$G$\"&MATCH($R23,$A$15:$A$110,0)+14)+INDIRECT(\"$G$\"&MATCH($R23,$A$15:$A$110,0)+15)+INDIRECT(\"$G$\"&MATCH($R23,$A$15:$A$110,0)+16)+INDIRECT(\"$G$\"&MATCH($R23,$A$15:$A$110,0)+17)","v":{"$error":"#N/A"}},{"$f":"INDIRECT(\"$H$\"&MATCH($R23,$A$15:$A$110,0)+14)+INDIRECT(\"$H$\"&MATCH($R23,$A$15:$A$110,0)+15)+INDIRECT(\"$H$\"&MATCH($R23,$A$15:$A$110,0)+16)+INDIRECT(\"$H$\"&MATCH($R23,$A$15:$A$110,0)+17)+INDIRECT(\"$I$\"&MATCH($R23,$A$15:$A$110,0)+14)+INDIRECT(\"$I$\"&MATCH($R23,$A$15:$A$110,0)+15)+INDIRECT(\"$I$\"&MATCH($R23,$A$15:$A$110,0)+16)+INDIRECT(\"$I$\"&MATCH($R23,$A$15:$A$110,0)+17)","v":{"$error":"#N/A"}},{"$f":"INDIRECT(\"$N$\"&MATCH($R23,$A$15:$A$110,0)+14)+INDIRECT(\"$N$\"&MATCH($R23,$A$15:$A$110,0)+15)+INDIRECT(\"$N$\"&MATCH($R23,$A$15:$A$110,0)+16)+INDIRECT(\"$N$\"&MATCH($R23,$A$15:$A$110,0)+17)+INDIRECT(\"$O$\"&MATCH($R23,$A$15:$A$110,0)+14)+INDIRECT(\"$O$\"&MATCH($R23,$A$15:$A$110,0)+15)+INDIRECT(\"$O$\"&MATCH($R23,$A$15:$A$110,0)+16)+INDIRECT(\"$O$\"&MATCH($R23,$A$15:$A$110,0)+17)","v":{"$error":"#N/A"}},{"$f":"R23","v":"8:00 AM"}]
[]
[]
[]
[null,null,null,null,null,null,null,null,null,null,null,null,null,null,null,null,null,"9:00 AM",{"$f":"INDIRECT(\"$P$\"&MATCH($R27,$A$15:$A$110,0)+14)+INDIRECT(\"$P$\"&MATCH($R27,$A$15:$A$110,0)+15)+INDIRECT(\"$P$\"&MATCH($R27,$A$15:$A$110,0)+16)+INDIRECT(\"$P$\"&MATCH($R27,$A$15:$A$110,0)+17)+INDIRECT(\"$Q$\"&MATCH($R27,$A$15:$A$110,0)+14)+INDIRECT(\"$Q$\"&MATCH($R27,$A$15:$A$110,0)+15)+INDIRECT(\"$Q$\"&MATCH($R27,$A$15:$A$110,0)+16)+INDIRECT(\"$Q$\"&MATCH($R27,$A$15:$A$110,0)+17)","v":{"$error":"#N/A"}},{"$f":"INDIRECT(\"$F$\"&MATCH($R27,$A$15:$A$110,0)+14)+INDIRECT(\"$F$\"&MATCH($R27,$A$15:$A$110,0)+15)+INDIRECT(\"$F$\"&MATCH($R27,$A$15:$A$110,0)+16)+INDIRECT(\"$F$\"&MATCH($R27,$A$15:$A$110,0)+17)+INDIRECT(\"$G$\"&MATCH($R27,$A$15:$A$110,0)+14)+INDIRECT(\"$G$\"&MATCH($R27,$A$15:$A$110,0)+15)+INDIRECT(\"$G$\"&MATCH($R27,$A$15:$A$110,0)+16)+INDIRECT(\"$G$\"&MATCH($R27,$A$15:$A$110,0)+17)","v":{"$error":"#N/A"}},{"$f":"INDIRECT(\"$H$\"&MATCH($R27,$A$15:$A$110,0)+14)+INDIRECT(\"$H$\"&MATCH($R27,$A$15:$A$110,0)+15)+INDIRECT(\"$H$\"&MATCH($R27,$A$15:$A$110,0)+16)+INDIRECT(\"$H$\"&MATCH($R27,$A$15:$A$110,0)+17)+INDIRECT(\"$I$\"&MATCH($R27,$A$15:$A$110,0)+14)+INDIRECT(\"$I$\"&MATCH($R27,$A$15:$A$110,0)+15)+INDIRECT(\"$I$\"&MATCH($R27,$A$15:$A$110,0)+16)+INDIRECT(\"$I$\"&MATCH($R27,$A$15:$A$110,0)+17)","v":{"$error":"#N/A"}},{"$f":"INDIRECT(\"$N$\"&MATCH($R27,$A$15:$A$110,0)+14)+INDIRECT(\"$N$\"&MATCH($R27,$A$15:$A$110,0)+15)+INDIRECT(\"$N$\"&MATCH($R27,$A$15:$A$110,0)+16)+INDIRECT(\"$N$\"&MATCH($R27,$A$15:$A$110,0)+17)+INDIRECT(\"$O$\"&MATCH($R27,$A$15:$A$110,0)+14)+INDIRECT(\"$O$\"&MATCH($R27,$A$15:$A$110,0)+15)+INDIRECT(\"$O$\"&MATCH($R27,$A$15:$A$110,0)+16)+INDIRECT(\"$O$\"&MATCH($R27,$A$15:$A$110,0)+17)","v":{"$error":"#N/A"}},{"$f":"R27","v":"9:00 AM"}]
[]
[]
[]
[null,null,null,null,null,null,null,null,null,null,null,null,null,null,null,null,null,"10:00 AM",{"$f":"INDIRECT(\"$P$\"&MATCH($R31,$A$15:$A$110,0)+14)+INDIRECT(\"$P$\"&MATCH($R31,$A$15:$A$110,0)+15)+INDIRECT(\"$P$\"&MATCH($R31,$A$15:$A$110,0)+16)+INDIRECT(\"$P$\"&MATCH($R31,$A$15:$A$110,0)+17)+INDIRECT(\"$Q$\"&MATCH($R31,$A$15:$A$110,0)+14)+INDIRECT(\"$Q$\"&MATCH($R31,$A$15:$A$110,0)+15)+INDIRECT(\"$Q$\"&MATCH($R31,$A$15:$A$110,0)+16)+INDIRECT(\"$Q$\"&MATCH($R31,$A$15:$A$110,0)+17)","v":{"$error":"#N/A"}},{"$f":"INDIRECT(\"$F$\"&MATCH($R31,$A$15:$A$110,0)+14)+INDIRECT(\"$F$\"&MATCH($R31,$A$15:$A$110,0)+15)+INDIRECT(\"$F$\"&MATCH($R31,$A$15:$A$110,0)+16)+INDIRECT(\"$F$\"&MATCH($R31,$A$15:$A$110,0)+17)+INDIRECT(\"$G$\"&MATCH($R31,$A$15:$A$110,0)+14)+INDIRECT(\"$G$\"&MATCH($R31,$A$15:$A$110,0)+15)+INDIRECT(\"$G$\"&MATCH($R31,$A$15:$A$110,0)+16)+INDIRECT(\"$G$\"&MATCH($R31,$A$15:$A$110,0)+17)","v":{"$error":"#N/A"}},{"$f":"INDIRECT(\"$H$\"&MATCH($R31,$A$15:$A$110,0)+14)+INDIRECT(\"$H$\"&MATCH($R31,$A$15:$A$110,0)+15)+INDIRECT(\"$H$\"&MATCH($R31,$A$15:$A$110,0)+16)+INDIRECT(\"$H$\"&MATCH($R31,$A$15:$A$110,0)+17)+INDIRECT(\"$I$\"&MATCH($R31,$A$15:$A$110,0)+14)+INDIRECT(\"$I$\"&MATCH($R31,$A$15:$A$110,0)+15)+INDIRECT(\"$I$\"&MATCH($R31,$A$15:$A$110,0)+16)+INDIRECT(\"$I$\"&MATCH($R31,$A$15:$A$110,0)+17)","v":{"$error":"#N/A"}},{"$f":"INDIRECT(\"$N$\"&MATCH($R31,$A$15:$A$110,0)+14)+INDIRECT(\"$N$\"&MATCH($R31,$A$15:$A$110,0)+15)+INDIRECT(\"$N$\"&MATCH($R31,$A$15:$A$110,0)+16)+INDIRECT(\"$N$\"&MATCH($R31,$A$15:$A$110,0)+17)+INDIRECT(\"$O$\"&MATCH($R31,$A$15:$A$110,0)+14)+INDIRECT(\"$O$\"&MATCH($R31,$A$15:$A$110,0)+15)+INDIRECT(\"$O$\"&MATCH($R31,$A$15:$A$110,0)+16)+INDIRECT(\"$O$\"&MATCH($R31,$A$15:$A$110,0)+17)","v":{"$error":"#N/A"}},{"$f":"R31","v":"10:00 AM"}]
[]
[]
[]
[null,null,null,null,null,null,null,null,null,null,null,null,null,null,null,null,null,"11:00 AM",{"$f":"INDIRECT(\"$P$\"&MATCH($R35,$A$15:$A$110,0)+14)+INDIRECT(\"$P$\"&MATCH($R35,$A$15:$A$110,0)+15)+INDIRECT(\"$P$\"&MATCH($R35,$A$15:$A$110,0)+16)+INDIRECT(\"$P$\"&MATCH($R35,$A$15:$A$110,0)+17)+INDIRECT(\"$Q$\"&MATCH($R35,$A$15:$A$110,0)+14)+INDIRECT(\"$Q$\"&MATCH($R35,$A$15:$A$110,0)+15)+INDIRECT(\"$Q$\"&MATCH($R35,$A$15:$A$110,0)+16)+INDIRECT(\"$Q$\"&MATCH($R35,$A$15:$A$110,0)+17)","v":{"$error":"#N/A"}},{"$f":"INDIRECT(\"$F$\"&MATCH($R35,$A$15:$A$110,0)+14)+INDIRECT(\"$F$\"&MATCH($R35,$A$15:$A$110,0)+15)+INDIRECT(\"$F$\"&MATCH($R35,$A$15:$A$110,0)+16)+INDIRECT(\"$F$\"&MATCH($R35,$A$15:$A$110,0)+17)+INDIRECT(\"$G$\"&MATCH($R35,$A$15:$A$110,0)+14)+INDIRECT(\"$G$\"&MATCH($R35,$A$15:$A$110,0)+15)+INDIRECT(\"$G$\"&MATCH($R35,$A$15:$A$110,0)+16)+INDIRECT(\"$G$\"&MATCH($R35,$A$15:$A$110,0)+17)","v":{"$error":"#N/A"}},{"$f":"INDIRECT(\"$H$\"&MATCH($R35,$A$15:$A$110,0)+14)+INDIRECT(\"$H$\"&MATCH($R35,$A$15:$A$110,0)+15)+INDIRECT(\"$H$\"&MATCH($R35,$A$15:$A$110,0)+16)+INDIRECT(\"$H$\"&MATCH($R35,$A$15:$A$110,0)+17)+INDIRECT(\"$I$\"&MATCH($R35,$A$15:$A$110,0)+14)+INDIRECT(\"$I$\"&MATCH($R35,$A$15:$A$110,0)+15)+INDIRECT(\"$I$\"&MATCH($R35,$A$15:$A$110,0)+16)+INDIRECT(\"$I$\"&MATCH($R35,$A$15:$A$110,0)+17)","v":{"$error":"#N/A"}},{"$f":"INDIRECT(\"$N$\"&MATCH($R35,$A$15:$A$110,0)+14)+INDIRECT(\"$N$\"&MATCH($R35,$A$15:$A$110,0)+15)+INDIRECT(\"$N$\"&MATCH($R35,$A$15:$A$110,0)+16)+INDIRECT(\"$N$\"&MATCH($R35,$A$15:$A$110,0)+17)+INDIRECT(\"$O$\"&MATCH($R35,$A$15:$A$110,0)+14)+INDIRECT(\"$O$\"&MATCH($R35,$A$15:$A$110,0)+15)+INDIRECT(\"$O$\"&MATCH($R35,$A$15:$A$110,0)+16)+INDIRECT(\"$O$\"&MATCH($R35,$A$15:$A$110,0)+17)","v":{"$error":"#N/A"}},{"$f":"R35","v":"11:00 AM"}]
[]
[]
[]
[null,null,null,null,null,null,null,null,null,null,null,null,null,null,null,null,null,"12:00 PM",{"$f":"INDIRECT(\"$P$\"&MATCH($R39,$A$15:$A$110,0)+14)+INDIRECT(\"$P$\"&MATCH($R39,$A$15:$A$110,0)+15)+INDIRECT(\"$P$\"&MATCH($R39,$A$15:$A$110,0)+16)+INDIRECT(\"$P$\"&MATCH($R39,$A$15:$A$110,0)+17)+INDIRECT(\"$Q$\"&MATCH($R39,$A$15:$A$110,0)+14)+INDIRECT(\"$Q$\"&MATCH($R39,$A$15:$A$110,0)+15)+INDIRECT(\"$Q$\"&MATCH($R39,$A$15:$A$110,0)+16)+INDIRECT(\"$Q$\"&MATCH($R39,$A$15:$A$110,0)+17)","v":{"$error":"#N/A"}},{"$f":"INDIRECT(\"$F$\"&MATCH($R39,$A$15:$A$110,0)+14)+INDIRECT(\"$F$\"&MATCH($R39,$A$15:$A$110,0)+15)+INDIRECT(\"$F$\"&MATCH($R39,$A$15:$A$110,0)+16)+INDIRECT(\"$F$\"&MATCH($R39,$A$15:$A$110,0)+17)+INDIRECT(\"$G$\"&MATCH($R39,$A$15:$A$110,0)+14)+INDIRECT(\"$G$\"&MATCH($R39,$A$15:$A$110,0)+15)+INDIRECT(\"$G$\"&MATCH($R39,$A$15:$A$110,0)+16)+INDIRECT(\"$G$\"&MATCH($R39,$A$15:$A$110,0)+17)","v":{"$error":"#N/A"}},{"$f":"INDIRECT(\"$H$\"&MATCH($R39,$A$15:$A$110,0)+14)+INDIRECT(\"$H$\"&MATCH($R39,$A$15:$A$110,0)+15)+INDIRECT(\"$H$\"&MATCH($R39,$A$15:$A$110,0)+16)+INDIRECT(\"$H$\"&MATCH($R39,$A$15:$A$110,0)+17)+INDIRECT(\"$I$\"&MATCH($R39,$A$15:$A$110,0)+14)+INDIRECT(\"$I$\"&MATCH($R39,$A$15:$A$110,0)+15)+INDIRECT(\"$I$\"&MATCH($R39,$A$15:$A$110,0)+16)+INDIRECT(\"$I$\"&MATCH($R39,$A$15:$A$110,0)+17)","v":{"$error":"#N/A"}},{"$f":"INDIRECT(\"$N$\"&MATCH($R39,$A$15:$A$110,0)+14)+INDIRECT(\"$N$\"&MATCH($R39,$A$15:$A$110,0)+15)+INDIRECT(\"$N$\"&MATCH($R39,$A$15:$A$110,0)+16)+INDIRECT(\"$N$\"&MATCH($R39,$A$15:$A$110,0)+17)+INDIRECT(\"$O$\"&MATCH($R39,$A$15:$A$110,0)+14)+INDIRECT(\"$O$\"&MATCH($R39,$A$15:$A$110,0)+15)+INDIRECT(\"$O$\"&MATCH($R39,$A$15:$A$110,0)+16)+INDIRECT(\"$O$\"&MATCH($R39,$A$15:$A$110,0)+17)","v":{"$error":"#N/A"}},{"$f":"R39","v":"12:00 PM"}]
[]
[]
[]
[null,null,null,null,null,null,null,null,null,null,null,null,null,null,null,null,null,"1:00 PM",{"$f":"INDIRECT(\"$P$\"&MATCH($R43,$A$15:$A$110,0)+14)+INDIRECT(\"$P$\"&MATCH($R43,$A$15:$A$110,0)+15)+INDIRECT(\"$P$\"&MATCH($R43,$A$15:$A$110,0)+16)+INDIRECT(\"$P$\"&MATCH($R43,$A$15:$A$110,0)+17)+INDIRECT(\"$Q$\"&MATCH($R43,$A$15:$A$110,0)+14)+INDIRECT(\"$Q$\"&MATCH($R43,$A$15:$A$110,0)+15)+INDIRECT(\"$Q$\"&MATCH($R43,$A$15:$A$110,0)+16)+INDIRECT(\"$Q$\"&MATCH($R43,$A$15:$A$110,0)+17)","v":{"$error":"#N/A"}},{"$f":"INDIRECT(\"$F$\"&MATCH($R43,$A$15:$A$110,0)+14)+INDIRECT(\"$F$\"&MATCH($R43,$A$15:$A$110,0)+15)+INDIRECT(\"$F$\"&MATCH($R43,$A$15:$A$110,0)+16)+INDIRECT(\"$F$\"&MATCH($R43,$A$15:$A$110,0)+17)+INDIRECT(\"$G$\"&MATCH($R43,$A$15:$A$110,0)+14)+INDIRECT(\"$G$\"&MATCH($R43,$A$15:$A$110,0)+15)+INDIRECT(\"$G$\"&MATCH($R43,$A$15:$A$110,0)+16)+INDIRECT(\"$G$\"&MATCH($R43,$A$15:$A$110,0)+17)","v":{"$error":"#N/A"}},{"$f":"INDIRECT(\"$H$\"&MATCH($R43,$A$15:$A$110,0)+14)+INDIRECT(\"$H$\"&MATCH($R43,$A$15:$A$110,0)+15)+INDIRECT(\"$H$\"&MATCH($R43,$A$15:$A$110,0)+16)+INDIRECT(\"$H$\"&MATCH($R43,$A$15:$A$110,0)+17)+INDIRECT(\"$I$\"&MATCH($R43,$A$15:$A$110,0)+14)+INDIRECT(\"$I$\"&MATCH($R43,$A$15:$A$110,0)+15)+INDIRECT(\"$I$\"&MATCH($R43,$A$15:$A$110,0)+16)+INDIRECT(\"$I$\"&MATCH($R43,$A$15:$A$110,0)+17)","v":{"$error":"#N/A"}},{"$f":"INDIRECT(\"$N$\"&MATCH($R43,$A$15:$A$110,0)+14)+INDIRECT(\"$N$\"&MATCH($R43,$A$15:$A$110,0)+15)+INDIRECT(\"$N$\"&MATCH($R43,$A$15:$A$110,0)+16)+INDIRECT(\"$N$\"&MATCH($R43,$A$15:$A$110,0)+17)+INDIRECT(\"$O$\"&MATCH($R43,$A$15:$A$110,0)+14)+INDIRECT(\"$O$\"&MATCH($R43,$A$15:$A$110,0)+15)+INDIRECT(\"$O$\"&MATCH($R43,$A$15:$A$110,0)+16)+INDIRECT(\"$O$\"&MATCH($R43,$A$15:$A$110,0)+17)","v":{"$error":"#N/A"}},{"$f":"R43","v":"1:00 PM"}]
[]
[]
[]
[null,null,null,null,null,null,null,null,null,null,null,null,null,null,null,null,null,"2:00 PM",{"$f":"INDIRECT(\"$P$\"&MATCH($R47,$A$15:$A$110,0)+14)+INDIRECT(\"$P$\"&MATCH($R47,$A$15:$A$110,0)+15)+INDIRECT(\"$P$\"&MATCH($R47,$A$15:$A$110,0)+16)+INDIRECT(\"$P$\"&MATCH($R47,$A$15:$A$110,0)+17)+INDIRECT(\"$Q$\"&MATCH($R47,$A$15:$A$110,0)+14)+INDIRECT(\"$Q$\"&MATCH($R47,$A$15:$A$110,0)+15)+INDIRECT(\"$Q$\"&MATCH($R47,$A$15:$A$110,0)+16)+INDIRECT(\"$Q$\"&MATCH($R47,$A$15:$A$110,0)+17)","v":{"$error":"#N/A"}},{"$f":"INDIRECT(\"$F$\"&MATCH($R47,$A$15:$A$110,0)+14)+INDIRECT(\"$F$\"&MATCH($R47,$A$15:$A$110,0)+15)+INDIRECT(\"$F$\"&MATCH($R47,$A$15:$A$110,0)+16)+INDIRECT(\"$F$\"&MATCH($R47,$A$15:$A$110,0)+17)+INDIRECT(\"$G$\"&MATCH($R47,$A$15:$A$110,0)+14)+INDIRECT(\"$G$\"&MATCH($R47,$A$15:$A$110,0)+15)+INDIRECT(\"$G$\"&MATCH($R47,$A$15:$A$110,0)+16)+INDIRECT(\"$G$\"&MATCH($R47,$A$15:$A$110,0)+17)","v":{"$error":"#N/A"}},{"$f":"INDIRECT(\"$H$\"&MATCH($R47,$A$15:$A$110,0)+14)+INDIRECT(\"$H$\"&MATCH($R47,$A$15:$A$110,0)+15)+INDIRECT(\"$H$\"&MATCH($R47,$A$15:$A$110,0)+16)+INDIRECT(\"$H$\"&MATCH($R47,$A$15:$A$110,0)+17)+INDIRECT(\"$I$\"&MATCH($R47,$A$15:$A$110,0)+14)+INDIRECT(\"$I$\"&MATCH($R47,$A$15:$A$110,0)+15)+INDIRECT(\"$I$\"&MATCH($R47,$A$15:$A$110,0)+16)+INDIRECT(\"$I$\"&MATCH($R47,$A$15:$A$110,0)+17)","v":{"$error":"#N/A"}},{"$f":"INDIRECT(\"$N$\"&MATCH($R47,$A$15:$A$110,0)+14)+INDIRECT(\"$N$\"&MATCH($R47,$A$15:$A$110,0)+15)+INDIRECT(\"$N$\"&MATCH($R47,$A$15:$A$110,0)+16)+INDIRECT(\"$N$\"&MATCH($R47,$A$15:$A$110,0)+17)+INDIRECT(\"$O$\"&MATCH($R47,$A$15:$A$110,0)+14)+INDIRECT(\"$O$\"&MATCH($R47,$A$15:$A$110,0)+15)+INDIRECT(\"$O$\"&MATCH($R47,$A$15:$A$110,0)+16)+INDIRECT(\"$O$\"&MATCH($R47,$A$15:$A$110,0)+17)","v":{"$error":"#N/A"}},{"$f":"R47","v":"2:00 PM"}]
[]
[]
[]
[null,null,null,null,null,null,null,null,null,null,null,null,null,null,null,null,null,"3:00 PM",{"$f":"INDIRECT(\"$P$\"&MATCH($R51,$A$15:$A$110,0)+14)+INDIRECT(\"$P$\"&MATCH($R51,$A$15:$A$110,0)+15)+INDIRECT(\"$P$\"&MATCH($R51,$A$15:$A$110,0)+16)+INDIRECT(\"$P$\"&MATCH($R51,$A$15:$A$110,0)+17)+INDIRECT(\"$Q$\"&MATCH($R51,$A$15:$A$110,0)+14)+INDIRECT(\"$Q$\"&MATCH($R51,$A$15:$A$110,0)+15)+INDIRECT(\"$Q$\"&MATCH($R51,$A$15:$A$110,0)+16)+INDIRECT(\"$Q$\"&MATCH($R51,$A$15:$A$110,0)+17)","v":{"$error":"#N/A"}},{"$f":"INDIRECT(\"$F$\"&MATCH($R51,$A$15:$A$110,0)+14)+INDIRECT(\"$F$\"&MATCH($R51,$A$15:$A$110,0)+15)+INDIRECT(\"$F$\"&MATCH($R51,$A$15:$A$110,0)+16)+INDIRECT(\"$F$\"&MATCH($R51,$A$15:$A$110,0)+17)+INDIRECT(\"$G$\"&MATCH($R51,$A$15:$A$110,0)+14)+INDIRECT(\"$G$\"&MATCH($R51,$A$15:$A$110,0)+15)+INDIRECT(\"$G$\"&MATCH($R51,$A$15:$A$110,0)+16)+INDIRECT(\"$G$\"&MATCH($R51,$A$15:$A$110,0)+17)","v":{"$error":"#N/A"}},{"$f":"INDIRECT(\"$H$\"&MATCH($R51,$A$15:$A$110,0)+14)+INDIRECT(\"$H$\"&MATCH($R51,$A$15:$A$110,0)+15)+INDIRECT(\"$H$\"&MATCH($R51,$A$15:$A$110,0)+16)+INDIRECT(\"$H$\"&MATCH($R51,$A$15:$A$110,0)+17)+INDIRECT(\"$I$\"&MATCH($R51,$A$15:$A$110,0)+14)+INDIRECT(\"$I$\"&MATCH($R51,$A$15:$A$110,0)+15)+INDIRECT(\"$I$\"&MATCH($R51,$A$15:$A$110,0)+16)+INDIRECT(\"$I$\"&MATCH($R51,$A$15:$A$110,0)+17)","v":{"$error":"#N/A"}},{"$f":"INDIRECT(\"$N$\"&MATCH($R51,$A$15:$A$110,0)+14)+INDIRECT(\"$N$\"&MATCH($R51,$A$15:$A$110,0)+15)+INDIRECT(\"$N$\"&MATCH($R51,$A$15:$A$110,0)+16)+INDIRECT(\"$N$\"&MATCH($R51,$A$15:$A$110,0)+17)+INDIRECT(\"$O$\"&MATCH($R51,$A$15:$A$110,0)+14)+INDIRECT(\"$O$\"&MATCH($R51,$A$15:$A$110,0)+15)+INDIRECT(\"$O$\"&MATCH($R51,$A$15:$A$110,0)+16)+INDIRECT(\"$O$\"&MATCH($R51,$A$15:$A$110,0)+17)","v":{"$error":"#N/A"}},{"$f":"R51","v":"3:00 PM"}]
[]
[]
[]
[null,null,null,null,null,null,null,null,null,null,null,null,null,null,null,null,null,"4:00 PM",{"$f":"INDIRECT(\"$P$\"&MATCH($R55,$A$15:$A$110,0)+14)+INDIRECT(\"$P$\"&MATCH($R55,$A$15:$A$110,0)+15)+INDIRECT(\"$P$\"&MATCH($R55,$A$15:$A$110,0)+16)+INDIRECT(\"$P$\"&MATCH($R55,$A$15:$A$110,0)+17)+INDIRECT(\"$Q$\"&MATCH($R55,$A$15:$A$110,0)+14)+INDIRECT(\"$Q$\"&MATCH($R55,$A$15:$A$110,0)+15)+INDIRECT(\"$Q$\"&MATCH($R55,$A$15:$A$110,0)+16)+INDIRECT(\"$Q$\"&MATCH($R55,$A$15:$A$110,0)+17)","v":{"$error":"#N/A"}},{"$f":"INDIRECT(\"$F$\"&MATCH($R55,$A$15:$A$110,0)+14)+INDIRECT(\"$F$\"&MATCH($R55,$A$15:$A$110,0)+15)+INDIRECT(\"$F$\"&MATCH($R55,$A$15:$A$110,0)+16)+INDIRECT(\"$F$\"&MATCH($R55,$A$15:$A$110,0)+17)+INDIRECT(\"$G$\"&MATCH($R55,$A$15:$A$110,0)+14)+INDIRECT(\"$G$\"&MATCH($R55,$A$15:$A$110,0)+15)+INDIRECT(\"$G$\"&MATCH($R55,$A$15:$A$110,0)+16)+INDIRECT(\"$G$\"&MATCH($R55,$A$15:$A$110,0)+17)","v":{"$error":"#N/A"}},{"$f":"INDIRECT(\"$H$\"&MATCH($R55,$A$15:$A$110,0)+14)+INDIRECT(\"$H$\"&MATCH($R55,$A$15:$A$110,0)+15)+INDIRECT(\"$H$\"&MATCH($R55,$A$15:$A$110,0)+16)+INDIRECT(\"$H$\"&MATCH($R55,$A$15:$A$110,0)+17)+INDIRECT(\"$I$\"&MATCH($R55,$A$15:$A$110,0)+14)+INDIRECT(\"$I$\"&MATCH($R55,$A$15:$A$110,0)+15)+INDIRECT(\"$I$\"&MATCH($R55,$A$15:$A$110,0)+16)+INDIRECT(\"$I$\"&MATCH($R55,$A$15:$A$110,0)+17)","v":{"$error":"#N/A"}},{"$f":"INDIRECT(\"$N$\"&MATCH($R55,$A$15:$A$110,0)+14)+INDIRECT(\"$N$\"&MATCH($R55,$A$15:$A$110,0)+15)+INDIRECT(\"$N$\"&MATCH($R55,$A$15:$A$110,0)+16)+INDIRECT(\"$N$\"&MATCH($R55,$A$15:$A$110,0)+17)+INDIRECT(\"$O$\"&MATCH($R55,$A$15:$A$110,0)+14)+INDIRECT(\"$O$\"&MATCH($R55,$A$15:$A$110,0)+15)+INDIRECT(\"$O$\"&MATCH($R55,$A$15:$A$110,0)+16)+INDIRECT(\"$O$\"&MATCH($R55,$A$15:$A$110,0)+17)","v":{"$error":"#N/A"}},{"$f":"R55","v":"4:00 PM"}]
[]
[]
[]
[null,null,null,null,null,null,null,null,null,null,null,null,null,null,null,null,null,"5:00 PM",{"$f":"INDIRECT(\"$P$\"&MATCH($R59,$A$15:$A$110,0)+14)+INDIRECT(\"$P$\"&MATCH($R59,$A$15:$A$110,0)+15)+INDIRECT(\"$P$\"&MATCH($R59,$A$15:$A$110,0)+16)+INDIRECT(\"$P$\"&MATCH($R59,$A$15:$A$110,0)+17)+INDIRECT(\"$Q$\"&MATCH($R59,$A$15:$A$110,0)+14)+INDIRECT(\"$Q$\"&MATCH($R59,$A$15:$A$110,0)+15)+INDIRECT(\"$Q$\"&MATCH($R59,$A$15:$A$110,0)+16)+INDIRECT(\"$Q$\"&MATCH($R59,$A$15:$A$110,0)+17)","v":{"$error":"#N/A"}},{"$f":"INDIRECT(\"$F$\"&MATCH($R59,$A$15:$A$110,0)+14)+INDIRECT(\"$F$\"&MATCH($R59,$A$15:$A$110,0)+15)+INDIRECT(\"$F$\"&MATCH($R59,$A$15:$A$110,0)+16)+INDIRECT(\"$F$\"&MATCH($R59,$A$15:$A$110,0)+17)+INDIRECT(\"$G$\"&MATCH($R59,$A$15:$A$110,0)+14)+INDIRECT(\"$G$\"&MATCH($R59,$A$15:$A$110,0)+15)+INDIRECT(\"$G$\"&MATCH($R59,$A$15:$A$110,0)+16)+INDIRECT(\"$G$\"&MATCH($R59,$A$15:$A$110,0)+17)","v":{"$error":"#N/A"}},{"$f":"INDIRECT(\"$H$\"&MATCH($R59,$A$15:$A$110,0)+14)+INDIRECT(\"$H$\"&MATCH($R59,$A$15:$A$110,0)+15)+INDIRECT(\"$H$\"&MATCH($R59,$A$15:$A$110,0)+16)+INDIRECT(\"$H$\"&MATCH($R59,$A$15:$A$110,0)+17)+INDIRECT(\"$I$\"&MATCH($R59,$A$15:$A$110,0)+14)+INDIRECT(\"$I$\"&MATCH($R59,$A$15:$A$110,0)+15)+INDIRECT(\"$I$\"&MATCH($R59,$A$15:$A$110,0)+16)+INDIRECT(\"$I$\"&MATCH($R59,$A$15:$A$110,0)+17)","v":{"$error":"#N/A"}},{"$f":"INDIRECT(\"$N$\"&MATCH($R59,$A$15:$A$110,0)+14)+INDIRECT(\"$N$\"&MATCH($R59,$A$15:$A$110,0)+15)+INDIRECT(\"$N$\"&MATCH($R59,$A$15:$A$110,0)+16)+INDIRECT(\"$N$\"&MATCH($R59,$A$15:$A$110,0)+17)+INDIRECT(\"$O$\"&MATCH($R59,$A$15:$A$110,0)+14)+INDIRECT(\"$O$\"&MATCH($R59,$A$15:$A$110,0)+15)+INDIRECT(\"$O$\"&MATCH($R59,$A$15:$A$110,0)+16)+INDIRECT(\"$O$\"&MATCH($R59,$A$15:$A$110,0)+17)","v":{"$error":"#N/A"}},{"$f":"R59","v":"5:00 PM"}]
[]
[]
[]
[null,null,null,null,null,null,null,null,null,null,null,null,null,null,null,null,null,"6:00 PM",{"$f":"INDIRECT(\"$P$\"&MATCH($R63,$A$15:$A$110,0)+14)+INDIRECT(\"$P$\"&MATCH($R63,$A$15:$A$110,0)+15)+INDIRECT(\"$P$\"&MATCH($R63,$A$15:$A$110,0)+16)+INDIRECT(\"$P$\"&MATCH($R63,$A$15:$A$110,0)+17)+INDIRECT(\"$Q$\"&MATCH($R63,$A$15:$A$110,0)+14)+INDIRECT(\"$Q$\"&MATCH($R63,$A$15:$A$110,0)+15)+INDIRECT(\"$Q$\"&MATCH($R63,$A$15:$A$110,0)+16)+INDIRECT(\"$Q$\"&MATCH($R63,$A$15:$A$110,0)+17)","v":{"$error":"#N/A"}},{"$f":"INDIRECT(\"$F$\"&MATCH($R63,$A$15:$A$110,0)+14)+INDIRECT(\"$F$\"&MATCH($R63,$A$15:$A$110,0)+15)+INDIRECT(\"$F$\"&MATCH($R63,$A$15:$A$110,0)+16)+INDIRECT(\"$F$\"&MATCH($R63,$A$15:$A$110,0)+17)+INDIRECT(\"$G$\"&MATCH($R63,$A$15:$A$110,0)+14)+INDIRECT(\"$G$\"&MATCH($R63,$A$15:$A$110,0)+15)+INDIRECT(\"$G$\"&MATCH($R63,$A$15:$A$110,0)+16)+INDIRECT(\"$G$\"&MATCH($R63,$A$15:$A$110,0)+17)","v":{"$error":"#N/A"}},{"$f":"INDIRECT(\"$H$\"&MATCH($R63,$A$15:$A$110,0)+14)+INDIRECT(\"$H$\"&MATCH($R63,$A$15:$A$110,0)+15)+INDIRECT(\"$H$\"&MATCH($R63,$A$15:$A$110,0)+16)+INDIRECT(\"$H$\"&MATCH($R63,$A$15:$A$110,0)+17)+INDIRECT(\"$I$\"&MATCH($R63,$A$15:$A$110,0)+14)+INDIRECT(\"$I$\"&MATCH($R63,$A$15:$A$110,0)+15)+INDIRECT(\"$I$\"&MATCH($R63,$A$15:$A$110,0)+16)+INDIRECT(\"$I$\"&MATCH($R63,$A$15:$A$110,0)+17)","v":{"$error":"#N/A"}},{"$f":"INDIRECT(\"$N$\"&MATCH($R63,$A$15:$A$110,0)+14)+INDIRECT(\"$N$\"&MATCH($R63,$A$15:$A$110,0)+15)+INDIRECT(\"$N$\"&MATCH($R63,$A$15:$A$110,0)+16)+INDIRECT(\"$N$\"&MATCH($R63,$A$15:$A$110,0)+17)+INDIRECT(\"$O$\"&MATCH($R63,$A$15:$A$110,0)+14)+INDIRECT(\"$O$\"&MATCH($R63,$A$15:$A$110,0)+15)+INDIRECT(\"$O$\"&MATCH($R63,$A$15:$A$110,0)+16)+INDIRECT(\"$O$\"&MATCH($R63,$A$15:$A$110,0)+17)","v":{"$error":"#N/A"}},{"$f":"R63","v":"6:00 PM"}]
[]
[]
[]
[null,null,null,null,null,null,null,null,null,null,null,null,null,null,null,null,null,"7:00 PM",{"$f":"INDIRECT(\"$P$\"&MATCH($R67,$A$15:$A$110,0)+14)+INDIRECT(\"$P$\"&MATCH($R67,$A$15:$A$110,0)+15)+INDIRECT(\"$P$\"&MATCH($R67,$A$15:$A$110,0)+16)+INDIRECT(\"$P$\"&MATCH($R67,$A$15:$A$110,0)+17)+INDIRECT(\"$Q$\"&MATCH($R67,$A$15:$A$110,0)+14)+INDIRECT(\"$Q$\"&MATCH($R67,$A$15:$A$110,0)+15)+INDIRECT(\"$Q$\"&MATCH($R67,$A$15:$A$110,0)+16)+INDIRECT(\"$Q$\"&MATCH($R67,$A$15:$A$110,0)+17)","v":{"$error":"#N/A"}},{"$f":"INDIRECT(\"$F$\"&MATCH($R67,$A$15:$A$110,0)+14)+INDIRECT(\"$F$\"&MATCH($R67,$A$15:$A$110,0)+15)+INDIRECT(\"$F$\"&MATCH($R67,$A$15:$A$110,0)+16)+INDIRECT(\"$F$\"&MATCH($R67,$A$15:$A$110,0)+17)+INDIRECT(\"$G$\"&MATCH($R67,$A$15:$A$110,0)+14)+INDIRECT(\"$G$\"&MATCH($R67,$A$15:$A$110,0)+15)+INDIRECT(\"$G$\"&MATCH($R67,$A$15:$A$110,0)+16)+INDIRECT(\"$G$\"&MATCH($R67,$A$15:$A$110,0)+17)","v":{"$error":"#N/A"}},{"$f":"INDIRECT(\"$H$\"&MATCH($R67,$A$15:$A$110,0)+14)+INDIRECT(\"$H$\"&MATCH($R67,$A$15:$A$110,0)+15)+INDIRECT(\"$H$\"&MATCH($R67,$A$15:$A$110,0)+16)+INDIRECT(\"$H$\"&MATCH($R67,$A$15:$A$110,0)+17)+INDIRECT(\"$I$\"&MATCH($R67,$A$15:$A$110,0)+14)+INDIRECT(\"$I$\"&MATCH($R67,$A$15:$A$110,0)+15)+INDIRECT(\"$I$\"&MATCH($R67,$A$15:$A$110,0)+16)+INDIRECT(\"$I$\"&MATCH($R67,$A$15:$A$110,0)+17)","v":{"$error":"#N/A"}},{"$f":"INDIRECT(\"$N$\"&MATCH($R67,$A$15:$A$110,0)+14)+INDIRECT(\"$N$\"&MATCH($R67,$A$15:$A$110,0)+15)+INDIRECT(\"$N$\"&MATCH($R67,$A$15:$A$110,0)+16)+INDIRECT(\"$N$\"&MATCH($R67,$A$15:$A$110,0)+17)+INDIRECT(\"$O$\"&MATCH($R67,$A$15:$A$110,0)+14)+INDIRECT(\"$O$\"&MATCH($R67,$A$15:$A$110,0)+15)+INDIRECT(\"$O$\"&MATCH($R67,$A$15:$A$110,0)+16)+INDIRECT(\"$O$\"&MATCH($R67,$A$15:$A$110,0)+17)","v":{"$error":"#N/A"}},{"$f":"R67","v":"7:00 PM"}]
[]
[]
[]
[null,null,null,null,null,null,null,null,null,null,null,null,null,null,null,null,null,"8:00 PM",{"$f":"INDIRECT(\"$P$\"&MATCH($R71,$A$15:$A$110,0)+14)+INDIRECT(\"$P$\"&MATCH($R71,$A$15:$A$110,0)+15)+INDIRECT(\"$P$\"&MATCH($R71,$A$15:$A$110,0)+16)+INDIRECT(\"$P$\"&MATCH($R71,$A$15:$A$110,0)+17)+INDIRECT(\"$Q$\"&MATCH($R71,$A$15:$A$110,0)+14)+INDIRECT(\"$Q$\"&MATCH($R71,$A$15:$A$110,0)+15)+INDIRECT(\"$Q$\"&MATCH($R71,$A$15:$A$110,0)+16)+INDIRECT(\"$Q$\"&MATCH($R71,$A$15:$A$110,0)+17)","v":{"$error":"#N/A"}},{"$f":"INDIRECT(\"$F$\"&MATCH($R71,$A$15:$A$110,0)+14)+INDIRECT(\"$F$\"&MATCH($R71,$A$15:$A$110,0)+15)+INDIRECT(\"$F$\"&MATCH($R71,$A$15:$A$110,0)+16)+INDIRECT(\"$F$\"&MATCH($R71,$A$15:$A$110,0)+17)+INDIRECT(\"$G$\"&MATCH($R71,$A$15:$A$110,0)+14)+INDIRECT(\"$G$\"&MATCH($R71,$A$15:$A$110,0)+15)+INDIRECT(\"$G$\"&MATCH($R71,$A$15:$A$110,0)+16)+INDIRECT(\"$G$\"&MATCH($R71,$A$15:$A$110,0)+17)","v":{"$error":"#N/A"}},{"$f":"INDIRECT(\"$H$\"&MATCH($R71,$A$15:$A$110,0)+14)+INDIRECT(\"$H$\"&MATCH($R71,$A$15:$A$110,0)+15)+INDIRECT(\"$H$\"&MATCH($R71,$A$15:$A$110,0)+16)+INDIRECT(\"$H$\"&MATCH($R71,$A$15:$A$110,0)+17)+INDIRECT(\"$I$\"&MATCH($R71,$A$15:$A$110,0)+14)+INDIRECT(\"$I$\"&MATCH($R71,$A$15:$A$110,0)+15)+INDIRECT(\"$I$\"&MATCH($R71,$A$15:$A$110,0)+16)+INDIRECT(\"$I$\"&MATCH($R71,$A$15:$A$110,0)+17)","v":{"$error":"#N/A"}},{"$f":"INDIRECT(\"$N$\"&MATCH($R71,$A$15:$A$110,0)+14)+INDIRECT(\"$N$\"&MATCH($R71,$A$15:$A$110,0)+15)+INDIRECT(\"$N$\"&MATCH($R71,$A$15:$A$110,0)+16)+INDIRECT(\"$N$\"&MATCH($R71,$A$15:$A$110,0)+17)+INDIRECT(\"$O$\"&MATCH($R71,$A$15:$A$110,0)+14)+INDIRECT(\"$O$\"&MATCH($R71,$A$15:$A$110,0)+15)+INDIRECT(\"$O$\"&MATCH($R71,$A$15:$A$110,0)+16)+INDIRECT(\"$O$\"&MATCH($R71,$A$15:$A$110,0)+17)","v":{"$error":"#N/A"}},{"$f":"R71","v":"8:00 PM"}]
[]
[]
[]
[null,null,null,null,null,null,null,null,null,null,null,null,null,null,null,null,null,"9:00 PM",{"$f":"INDIRECT(\"$P$\"&MATCH($R75,$A$15:$A$110,0)+14)+INDIRECT(\"$P$\"&MATCH($R75,$A$15:$A$110,0)+15)+INDIRECT(\"$P$\"&MATCH($R75,$A$15:$A$110,0)+16)+INDIRECT(\"$P$\"&MATCH($R75,$A$15:$A$110,0)+17)+INDIRECT(\"$Q$\"&MATCH($R75,$A$15:$A$110,0)+14)+INDIRECT(\"$Q$\"&MATCH($R75,$A$15:$A$110,0)+15)+INDIRECT(\"$Q$\"&MATCH($R75,$A$15:$A$110,0)+16)+INDIRECT(\"$Q$\"&MATCH($R75,$A$15:$A$110,0)+17)","v":{"$error":"#N/A"}},{"$f":"INDIRECT(\"$F$\"&MATCH($R75,$A$15:$A$110,0)+14)+INDIRECT(\"$F$\"&MATCH($R75,$A$15:$A$110,0)+15)+INDIRECT(\"$F$\"&MATCH($R75,$A$15:$A$110,0)+16)+INDIRECT(\"$F$\"&MATCH($R75,$A$15:$A$110,0)+17)+INDIRECT(\"$G$\"&MATCH($R75,$A$15:$A$110,0)+14)+INDIRECT(\"$G$\"&MATCH($R75,$A$15:$A$110,0)+15)+INDIRECT(\"$G$\"&MATCH($R75,$A$15:$A$110,0)+16)+INDIRECT(\"$G$\"&MATCH($R75,$A$15:$A$110,0)+17)","v":{"$error":"#N/A"}},{"$f":"INDIRECT(\"$H$\"&MATCH($R75,$A$15:$A$110,0)+14)+INDIRECT(\"$H$\"&MATCH($R75,$A$15:$A$110,0)+15)+INDIRECT(\"$H$\"&MATCH($R75,$A$15:$A$110,0)+16)+INDIRECT(\"$H$\"&MATCH($R75,$A$15:$A$110,0)+17)+INDIRECT(\"$I$\"&MATCH($R75,$A$15:$A$110,0)+14)+INDIRECT(\"$I$\"&MATCH($R75,$A$15:$A$110,0)+15)+INDIRECT(\"$I$\"&MATCH($R75,$A$15:$A$110,0)+16)+INDIRECT(\"$I$\"&MATCH($R75,$A$15:$A$110,0)+17)","v":{"$error":"#N/A"}},{"$f":"INDIRECT(\"$N$\"&MATCH($R75,$A$15:$A$110,0)+14)+INDIRECT(\"$N$\"&MATCH($R75,$A$15:$A$110,0)+15)+INDIRECT(\"$N$\"&MATCH($R75,$A$15:$A$110,0)+16)+INDIRECT(\"$N$\"&MATCH($R75,$A$15:$A$110,0)+17)+INDIRECT(\"$O$\"&MATCH($R75,$A$15:$A$110,0)+14)+INDIRECT(\"$O$\"&MATCH($R75,$A$15:$A$110,0)+15)+INDIRECT(\"$O$\"&MATCH($R75,$A$15:$A$110,0)+16)+INDIRECT(\"$O$\"&MATCH($R75,$A$15:$A$110,0)+17)","v":{"$error":"#N/A"}},{"$f":"R75","v":"9:00 PM"}]
[]
[]
[]
[null,null,null,null,null,null,null,null,null,null,null,null,null,null,null,null,null,"10:00 PM",{"$f":"INDIRECT(\"$P$\"&MATCH($R79,$A$15:$A$110,0)+14)+INDIRECT(\"$P$\"&MATCH($R79,$A$15:$A$110,0)+15)+INDIRECT(\"$P$\"&MATCH($R79,$A$15:$A$110,0)+16)+INDIRECT(\"$P$\"&MATCH($R79,$A$15:$A$110,0)+17)+INDIRECT(\"$Q$\"&MATCH($R79,$A$15:$A$110,0)+14)+INDIRECT(\"$Q$\"&MATCH($R79,$A$15:$A$110,0)+15)+INDIRECT(\"$Q$\"&MATCH($R79,$A$15:$A$110,0)+16)+INDIRECT(\"$Q$\"&MATCH($R79,$A$15:$A$110,0)+17)","v":{"$error":"#N/A"}},{"$f":"INDIRECT(\"$F$\"&MATCH($R79,$A$15:$A$110,0)+14)+INDIRECT(\"$F$\"&MATCH($R79,$A$15:$A$110,0)+15)+INDIRECT(\"$F$\"&MATCH($R79,$A$15:$A$110,0)+16)+INDIRECT(\"$F$\"&MATCH($R79,$A$15:$A$110,0)+17)+INDIRECT(\"$G$\"&MATCH($R79,$A$15:$A$110,0)+14)+INDIRECT(\"$G$\"&MATCH($R79,$A$15:$A$110,0)+15)+INDIRECT(\"$G$\"&MATCH($R79,$A$15:$A$110,0)+16)+INDIRECT(\"$G$\"&MATCH($R79,$A$15:$A$110,0)+17)","v":{"$error":"#N/A"}},{"$f":"INDIRECT(\"$H$\"&MATCH($R79,$A$15:$A$110,0)+14)+INDIRECT(\"$H$\"&MATCH($R79,$A$15:$A$110,0)+15)+INDIRECT(\"$H$\"&MATCH($R79,$A$15:$A$110,0)+16)+INDIRECT(\"$H$\"&MATCH($R79,$A$15:$A$110,0)+17)+INDIRECT(\"$I$\"&MATCH($R79,$A$15:$A$110,0)+14)+INDIRECT(\"$I$\"&MATCH($R79,$A$15:$A$110,0)+15)+INDIRECT(\"$I$\"&MATCH($R79,$A$15:$A$110,0)+16)+INDIRECT(\"$I$\"&MATCH($R79,$A$15:$A$110,0)+17)","v":{"$error":"#N/A"}},{"$f":"INDIRECT(\"$N$\"&MATCH($R79,$A$15:$A$110,0)+14)+INDIRECT(\"$N$\"&MATCH($R79,$A$15:$A$110,0)+15)+INDIRECT(\"$N$\"&MATCH($R79,$A$15:$A$110,0)+16)+INDIRECT(\"$N$\"&MATCH($R79,$A$15:$A$110,0)+17)+INDIRECT(\"$O$\"&MATCH($R79,$A$15:$A$110,0)+14)+INDIRECT(\"$O$\"&MATCH($R79,$A$15:$A$110,0)+15)+INDIRECT(\"$O$\"&MATCH($R79,$A$15:$A$110,0)+16)+INDIRECT(\"$O$\"&MATCH($R79,$A$15:$A$110,0)+17)","v":{"$error":"#N/A"}},{"$f":"R79","v":"10:00 PM"}]
[]
[]
[]
[null,null,null,null,null,null,null,null,null,null,null,null,null,null,null,null,null,"11:00 PM",{"$f":"INDIRECT(\"$P$\"&MATCH($R83,$A$15:$A$110,0)+14)+INDIRECT(\"$P$\"&MATCH($R83,$A$15:$A$110,0)+15)+INDIRECT(\"$P$\"&MATCH($R83,$A$15:$A$110,0)+16)+INDIRECT(\"$P$\"&MATCH($R83,$A$15:$A$110,0)+17)+INDIRECT(\"$Q$\"&MATCH($R83,$A$15:$A$110,0)+14)+INDIRECT(\"$Q$\"&MATCH($R83,$A$15:$A$110,0)+15)+INDIRECT(\"$Q$\"&MATCH($R83,$A$15:$A$110,0)+16)+INDIRECT(\"$Q$\"&MATCH($R83,$A$15:$A$110,0)+17)","v":{"$error":"#N/A"}},{"$f":"INDIRECT(\"$F$\"&MATCH($R83,$A$15:$A$110,0)+14)+INDIRECT(\"$F$\"&MATCH($R83,$A$15:$A$110,0)+15)+INDIRECT(\"$F$\"&MATCH($R83,$A$15:$A$110,0)+16)+INDIRECT(\"$F$\"&MATCH($R83,$A$15:$A$110,0)+17)+INDIRECT(\"$G$\"&MATCH($R83,$A$15:$A$110,0)+14)+INDIRECT(\"$G$\"&MATCH($R83,$A$15:$A$110,0)+15)+INDIRECT(\"$G$\"&MATCH($R83,$A$15:$A$110,0)+16)+INDIRECT(\"$G$\"&MATCH($R83,$A$15:$A$110,0)+17)","v":{"$error":"#N/A"}},{"$f":"INDIRECT(\"$H$\"&MATCH($R83,$A$15:$A$110,0)+14)+INDIRECT(\"$H$\"&MATCH($R83,$A$15:$A$110,0)+15)+INDIRECT(\"$H$\"&MATCH($R83,$A$15:$A$110,0)+16)+INDIRECT(\"$H$\"&MATCH($R83,$A$15:$A$110,0)+17)+INDIRECT(\"$I$\"&MATCH($R83,$A$15:$A$110,0)+14)+INDIRECT(\"$I$\"&MATCH($R83,$A$15:$A$110,0)+15)+INDIRECT(\"$I$\"&MATCH($R83,$A$15:$A$110,0)+16)+INDIRECT(\"$I$\"&MATCH($R83,$A$15:$A$110,0)+17)","v":{"$error":"#N/A"}},{"$f":"INDIRECT(\"$N$\"&MATCH($R83,$A$15:$A$110,0)+14)+INDIRECT(\"$N$\"&MATCH($R83,$A$15:$A$110,0)+15)+INDIRECT(\"$N$\"&MATCH($R83,$A$15:$A$110,0)+16)+INDIRECT(\"$N$\"&MATCH($R83,$A$15:$A$110,0)+17)+INDIRECT(\"$O$\"&MATCH($R83,$A$15:$A$110,0)+14)+INDIRECT(\"$O$\"&MATCH($R83,$A$15:$A$110,0)+15)+INDIRECT(\"$O$\"&MATCH($R83,$A$15:$A$110,0)+16)+INDIRECT(\"$O$\"&MATCH($R83,$A$15:$A$110,0)+17)","v":{"$error":"#N/A"}},{"$f":"R83","v":"11:00 PM"}]
[]
[]
[]
[null,null,null,null,null,null,null,null,null,null,null,null,null,null,null,null,null,"12:00 AM",{"$f":"INDIRECT(\"$P$\"&MATCH($R87,$A$15:$A$110,0)+14)+INDIRECT(\"$P$\"&MATCH($R87,$A$15:$A$110,0)+15)+INDIRECT(\"$P$\"&MATCH($R87,$A$15:$A$110,0)+16)+INDIRECT(\"$P$\"&MATCH($R87,$A$15:$A$110,0)+17)+INDIRECT(\"$Q$\"&MATCH($R87,$A$15:$A$110,0)+14)+INDIRECT(\"$Q$\"&MATCH($R87,$A$15:$A$110,0)+15)+INDIRECT(\"$Q$\"&MATCH($R87,$A$15:$A$110,0)+16)+INDIRECT(\"$Q$\"&MATCH($R87,$A$15:$A$110,0)+17)","v":{"$error":"#N/A"}},{"$f":"INDIRECT(\"$F$\"&MATCH($R87,$A$15:$A$110,0)+14)+INDIRECT(\"$F$\"&MATCH($R87,$A$15:$A$110,0)+15)+INDIRECT(\"$F$\"&MATCH($R87,$A$15:$A$110,0)+16)+INDIRECT(\"$F$\"&MATCH($R87,$A$15:$A$110,0)+17)+INDIRECT(\"$G$\"&MATCH($R87,$A$15:$A$110,0)+14)+INDIRECT(\"$G$\"&MATCH($R87,$A$15:$A$110,0)+15)+INDIRECT(\"$G$\"&MATCH($R87,$A$15:$A$110,0)+16)+INDIRECT(\"$G$\"&MATCH($R87,$A$15:$A$110,0)+17)","v":{"$error":"#N/A"}},{"$f":"INDIRECT(\"$H$\"&MATCH($R87,$A$15:$A$110,0)+14)+INDIRECT(\"$H$\"&MATCH($R87,$A$15:$A$110,0)+15)+INDIRECT(\"$H$\"&MATCH($R87,$A$15:$A$110,0)+16)+INDIRECT(\"$H$\"&MATCH($R87,$A$15:$A$110,0)+17)+INDIRECT(\"$I$\"&MATCH($R87,$A$15:$A$110,0)+14)+INDIRECT(\"$I$\"&MATCH($R87,$A$15:$A$110,0)+15)+INDIRECT(\"$I$\"&MATCH($R87,$A$15:$A$110,0)+16)+INDIRECT(\"$I$\"&MATCH($R87,$A$15:$A$110,0)+17)","v":{"$error":"#N/A"}},{"$f":"INDIRECT(\"$N$\"&MATCH($R87,$A$15:$A$110,0)+14)+INDIRECT(\"$N$\"&MATCH($R87,$A$15:$A$110,0)+15)+INDIRECT(\"$N$\"&MATCH($R87,$A$15:$A$110,0)+16)+INDIRECT(\"$N$\"&MATCH($R87,$A$15:$A$110,0)+17)+INDIRECT(\"$O$\"&MATCH($R87,$A$15:$A$110,0)+14)+INDIRECT(\"$O$\"&MATCH($R87,$A$15:$A$110,0)+15)+INDIRECT(\"$O$\"&MATCH($R87,$A$15:$A$110,0)+16)+INDIRECT(\"$O$\"&MATCH($R87,$A$15:$A$110,0)+17)","v":{"$error":"#N/A"}},{"$f":"R87","v":"12:00 AM"}]
[]
[]
[]
[null,null,null,null,null,null,null,null,null,null,null,null,null,null,null,null,null,"1:00 AM",{"$f":"INDIRECT(\"$P$\"&MATCH($R91,$A$15:$A$110,0)+14)+INDIRECT(\"$P$\"&MATCH($R91,$A$15:$A$110,0)+15)+INDIRECT(\"$P$\"&MATCH($R91,$A$15:$A$110,0)+16)+INDIRECT(\"$P$\"&MATCH($R91,$A$15:$A$110,0)+17)+INDIRECT(\"$Q$\"&MATCH($R91,$A$15:$A$110,0)+14)+INDIRECT(\"$Q$\"&MATCH($R91,$A$15:$A$110,0)+15)+INDIRECT(\"$Q$\"&MATCH($R91,$A$15:$A$110,0)+16)+INDIRECT(\"$Q$\"&MATCH($R91,$A$15:$A$110,0)+17)","v":{"$error":"#N/A"}},{"$f":"INDIRECT(\"$F$\"&MATCH($R91,$A$15:$A$110,0)+14)+INDIRECT(\"$F$\"&MATCH($R91,$A$15:$A$110,0)+15)+INDIRECT(\"$F$\"&MATCH($R91,$A$15:$A$110,0)+16)+INDIRECT(\"$F$\"&MATCH($R91,$A$15:$A$110,0)+17)+INDIRECT(\"$G$\"&MATCH($R91,$A$15:$A$110,0)+14)+INDIRECT(\"$G$\"&MATCH($R91,$A$15:$A$110,0)+15)+INDIRECT(\"$G$\"&MATCH($R91,$A$15:$A$110,0)+16)+INDIRECT(\"$G$\"&MATCH($R91,$A$15:$A$110,0)+17)","v":{"$error":"#N/A"}},{"$f":"INDIRECT(\"$H$\"&MATCH($R91,$A$15:$A$110,0)+14)+INDIRECT(\"$H$\"&MATCH($R91,$A$15:$A$110,0)+15)+INDIRECT(\"$H$\"&MATCH($R91,$A$15:$A$110,0)+16)+INDIRECT(\"$H$\"&MATCH($R91,$A$15:$A$110,0)+17)+INDIRECT(\"$I$\"&MATCH($R91,$A$15:$A$110,0)+14)+INDIRECT(\"$I$\"&MATCH($R91,$A$15:$A$110,0)+15)+INDIRECT(\"$I$\"&MATCH($R91,$A$15:$A$110,0)+16)+INDIRECT(\"$I$\"&MATCH($R91,$A$15:$A$110,0)+17)","v":{"$error":"#N/A"}},{"$f":"INDIRECT(\"$N$\"&MATCH($R91,$A$15:$A$110,0)+14)+INDIRECT(\"$N$\"&MATCH($R91,$A$15:$A$110,0)+15)+INDIRECT(\"$N$\"&MATCH($R91,$A$15:$A$110,0)+16)+INDIRECT(\"$N$\"&MATCH($R91,$A$15:$A$110,0)+17)+INDIRECT(\"$O$\"&MATCH($R91,$A$15:$A$110,0)+14)+INDIRECT(\"$O$\"&MATCH($R91,$A$15:$A$110,0)+15)+INDIRECT(\"$O$\"&MATCH($R91,$A$15:$A$110,0)+16)+INDIRECT(\"$O$\"&MATCH($R91,$A$15:$A$110,0)+17)","v":{"$error":"#N/A"}},{"$f":"R91","v":"1:00 AM"}]
[]
[]
[]
[null,null,null,null,null,null,null,null,null,null,null,null,null,null,null,null,null,"2:00 AM",{"$f":"INDIRECT(\"$P$\"&MATCH($R95,$A$15:$A$110,0)+14)+INDIRECT(\"$P$\"&MATCH($R95,$A$15:$A$110,0)+15)+INDIRECT(\"$P$\"&MATCH($R95,$A$15:$A$110,0)+16)+INDIRECT(\"$P$\"&MATCH($R95,$A$15:$A$110,0)+17)+INDIRECT(\"$Q$\"&MATCH($R95,$A$15:$A$110,0)+14)+INDIRECT(\"$Q$\"&MATCH($R95,$A$15:$A$110,0)+15)+INDIRECT(\"$Q$\"&MATCH($R95,$A$15:$A$110,0)+16)+INDIRECT(\"$Q$\"&MATCH($R95,$A$15:$A$110,0)+17)","v":{"$error":"#N/A"}},{"$f":"INDIRECT(\"$F$\"&MATCH($R95,$A$15:$A$110,0)+14)+INDIRECT(\"$F$\"&MATCH($R95,$A$15:$A$110,0)+15)+INDIRECT(\"$F$\"&MATCH($R95,$A$15:$A$110,0)+16)+INDIRECT(\"$F$\"&MATCH($R95,$A$15:$A$110,0)+17)+INDIRECT(\"$G$\"&MATCH($R95,$A$15:$A$110,0)+14)+INDIRECT(\"$G$\"&MATCH($R95,$A$15:$A$110,0)+15)+INDIRECT(\"$G$\"&MATCH($R95,$A$15:$A$110,0)+16)+INDIRECT(\"$G$\"&MATCH($R95,$A$15:$A$110,0)+17)","v":{"$error":"#N/A"}},{"$f":"INDIRECT(\"$H$\"&MATCH($R95,$A$15:$A$110,0)+14)+INDIRECT(\"$H$\"&MATCH($R95,$A$15:$A$110,0)+15)+INDIRECT(\"$H$\"&MATCH($R95,$A$15:$A$110,0)+16)+INDIRECT(\"$H$\"&MATCH($R95,$A$15:$A$110,0)+17)+INDIRECT(\"$I$\"&MATCH($R95,$A$15:$A$110,0)+14)+INDIRECT(\"$I$\"&MATCH($R95,$A$15:$A$110,0)+15)+INDIRECT(\"$I$\"&MATCH($R95,$A$15:$A$110,0)+16)+INDIRECT(\"$I$\"&MATCH($R95,$A$15:$A$110,0)+17)","v":{"$error":"#N/A"}},{"$f":"INDIRECT(\"$N$\"&MATCH($R95,$A$15:$A$110,0)+14)+INDIRECT(\"$N$\"&MATCH($R95,$A$15:$A$110,0)+15)+INDIRECT(\"$N$\"&MATCH($R95,$A$15:$A$110,0)+16)+INDIRECT(\"$N$\"&MATCH($R95,$A$15:$A$110,0)+17)+INDIRECT(\"$O$\"&MATCH($R95,$A$15:$A$110,0)+14)+INDIRECT(\"$O$\"&MATCH($R95,$A$15:$A$110,0)+15)+INDIRECT(\"$O$\"&MATCH($R95,$A$15:$A$110,0)+16)+INDIRECT(\"$O$\"&MATCH($R95,$A$15:$A$110,0)+17)","v":{"$error":"#N/A"}},{"$f":"R95","v":"2:00 AM"}]
[]
[]
[]
[null,null,null,null,null,null,null,null,null,null,null,null,null,null,null,null,null,"3:00 AM",{"$f":"INDIRECT(\"$P$\"&MATCH($R99,$A$15:$A$110,0)+14)+INDIRECT(\"$P$\"&MATCH($R99,$A$15:$A$110,0)+15)+INDIRECT(\"$P$\"&MATCH($R99,$A$15:$A$110,0)+16)+INDIRECT(\"$P$\"&MATCH($R99,$A$15:$A$110,0)+17)+INDIRECT(\"$Q$\"&MATCH($R99,$A$15:$A$110,0)+14)+INDIRECT(\"$Q$\"&MATCH($R99,$A$15:$A$110,0)+15)+INDIRECT(\"$Q$\"&MATCH($R99,$A$15:$A$110,0)+16)+INDIRECT(\"$Q$\"&MATCH($R99,$A$15:$A$110,0)+17)","v":{"$error":"#N/A"}},{"$f":"INDIRECT(\"$F$\"&MATCH($R99,$A$15:$A$110,0)+14)+INDIRECT(\"$F$\"&MATCH($R99,$A$15:$A$110,0)+15)+INDIRECT(\"$F$\"&MATCH($R99,$A$15:$A$110,0)+16)+INDIRECT(\"$F$\"&MATCH($R99,$A$15:$A$110,0)+17)+INDIRECT(\"$G$\"&MATCH($R99,$A$15:$A$110,0)+14)+INDIRECT(\"$G$\"&MATCH($R99,$A$15:$A$110,0)+15)+INDIRECT(\"$G$\"&MATCH($R99,$A$15:$A$110,0)+16)+INDIRECT(\"$G$\"&MATCH($R99,$A$15:$A$110,0)+17)","v":{"$error":"#N/A"}},{"$f":"INDIRECT(\"$H$\"&MATCH($R99,$A$15:$A$110,0)+14)+INDIRECT(\"$H$\"&MATCH($R99,$A$15:$A$110,0)+15)+INDIRECT(\"$H$\"&MATCH($R99,$A$15:$A$110,0)+16)+INDIRECT(\"$H$\"&MATCH($R99,$A$15:$A$110,0)+17)+INDIRECT(\"$I$\"&MATCH($R99,$A$15:$A$110,0)+14)+INDIRECT(\"$I$\"&MATCH($R99,$A$15:$A$110,0)+15)+INDIRECT(\"$I$\"&MATCH($R99,$A$15:$A$110,0)+16)+INDIRECT(\"$I$\"&MATCH($R99,$A$15:$A$110,0)+17)","v":{"$error":"#N/A"}},{"$f":"INDIRECT(\"$N$\"&MATCH($R99,$A$15:$A$110,0)+14)+INDIRECT(\"$N$\"&MATCH($R99,$A$15:$A$110,0)+15)+INDIRECT(\"$N$\"&MATCH($R99,$A$15:$A$110,0)+16)+INDIRECT(\"$N$\"&MATCH($R99,$A$15:$A$110,0)+17)+INDIRECT(\"$O$\"&MATCH($R99,$A$15:$A$110,0)+14)+INDIRECT(\"$O$\"&MATCH($R99,$A$15:$A$110,0)+15)+INDIRECT(\"$O$\"&MATCH($R99,$A$15:$A$110,0)+16)+INDIRECT(\"$O$\"&MATCH($R99,$A$15:$A$110,0)+17)","v":{"$error":"#N/A"}},{"$f":"R99","v":"3:00 AM"}]
[]
[]
[]
[null,null,null,null,null,null,null,null,null,null,null,null,null,null,null,null,null,"4:00 AM",{"$f":"INDIRECT(\"$P$\"&MATCH($R103,$A$15:$A$110,0)+14)+INDIRECT(\"$P$\"&MATCH($R103,$A$15:$A$110,0)+15)+INDIRECT(\"$P$\"&MATCH($R103,$A$15:$A$110,0)+16)+INDIRECT(\"$P$\"&MATCH($R103,$A$15:$A$110,0)+17)+INDIRECT(\"$Q$\"&MATCH($R103,$A$15:$A$110,0)+14)+INDIRECT(\"$Q$\"&MATCH($R103,$A$15:$A$110,0)+15)+INDIRECT(\"$Q$\"&MATCH($R103,$A$15:$A$110,0)+16)+INDIRECT(\"$Q$\"&MATCH($R103,$A$15:$A$110,0)+17)","v":{"$error":"#N/A"}},{"$f":"INDIRECT(\"$F$\"&MATCH($R103,$A$15:$A$110,0)+14)+INDIRECT(\"$F$\"&MATCH($R103,$A$15:$A$110,0)+15)+INDIRECT(\"$F$\"&MATCH($R103,$A$15:$A$110,0)+16)+INDIRECT(\"$F$\"&MATCH($R103,$A$15:$A$110,0)+17)+INDIRECT(\"$G$\"&MATCH($R103,$A$15:$A$110,0)+14)+INDIRECT(\"$G$\"&MATCH($R103,$A$15:$A$110,0)+15)+INDIRECT(\"$G$\"&MATCH($R103,$A$15:$A$110,0)+16)+INDIRECT(\"$G$\"&MATCH($R103,$A$15:$A$110,0)+17)","v":{"$error":"#N/A"}},{"$f":"INDIRECT(\"$H$\"&MATCH($R103,$A$15:$A$110,0)+14)+INDIRECT(\"$H$\"&MATCH($R103,$A$15:$A$110,0)+15)+INDIRECT(\"$H$\"&MATCH($R103,$A$15:$A$110,0)+16)+INDIRECT(\"$H$\"&MATCH($R103,$A$15:$A$110,0)+17)+INDIRECT(\"$I$\"&MATCH($R103,$A$15:$A$110,0)+14)+INDIRECT(\"$I$\"&MATCH($R103,$A$15:$A$110,0)+15)+INDIRECT(\"$I$\"&MATCH($R103,$A$15:$A$110,0)+16)+INDIRECT(\"$I$\"&MATCH($R103,$A$15:$A$110,0)+17)","v":{"$error":"#N/A"}},{"$f":"INDIRECT(\"$N$\"&MATCH($R103,$A$15:$A$110,0)+14)+INDIRECT(\"$N$\"&MATCH($R103,$A$15:$A$110,0)+15)+INDIRECT(\"$N$\"&MATCH($R103,$A$15:$A$110,0)+16)+INDIRECT(\"$N$\"&MATCH($R103,$A$15:$A$110,0)+17)+INDIRECT(\"$O$\"&MATCH($R103,$A$15:$A$110,0)+14)+INDIRECT(\"$O$\"&MATCH($R103,$A$15:$A$110,0)+15)+INDIRECT(\"$O$\"&MATCH($R103,$A$15:$A$110,0)+16)+INDIRECT(\"$O$\"&MATCH($R103,$A$15:$A$110,0)+17)","v":{"$error":"#N/A"}},{"$f":"R103","v":"4:00 AM"}]
[]
[]
[]
[null,null,null,null,null,null,null,null,null,null,null,null,null,null,null,null,null,"5:00 AM",{"$f":"INDIRECT(\"$P$\"&MATCH($R107,$A$15:$A$110,0)+14)+INDIRECT(\"$P$\"&MATCH($R107,$A$15:$A$110,0)+15)+INDIRECT(\"$P$\"&MATCH($R107,$A$15:$A$110,0)+16)+INDIRECT(\"$P$\"&MATCH($R107,$A$15:$A$110,0)+17)+INDIRECT(\"$Q$\"&MATCH($R107,$A$15:$A$110,0)+14)+INDIRECT(\"$Q$\"&MATCH($R107,$A$15:$A$110,0)+15)+INDIRECT(\"$Q$\"&MATCH($R107,$A$15:$A$110,0)+16)+INDIRECT(\"$Q$\"&MATCH($R107,$A$15:$A$110,0)+17)","v":{"$error":"#N/A"}},{"$f":"INDIRECT(\"$F$\"&MATCH($R107,$A$15:$A$110,0)+14)+INDIRECT(\"$F$\"&MATCH($R107,$A$15:$A$110,0)+15)+INDIRECT(\"$F$\"&MATCH($R107,$A$15:$A$110,0)+16)+INDIRECT(\"$F$\"&MATCH($R107,$A$15:$A$110,0)+17)+INDIRECT(\"$G$\"&MATCH($R107,$A$15:$A$110,0)+14)+INDIRECT(\"$G$\"&MATCH($R107,$A$15:$A$110,0)+15)+INDIRECT(\"$G$\"&MATCH($R107,$A$15:$A$110,0)+16)+INDIRECT(\"$G$\"&MATCH($R107,$A$15:$A$110,0)+17)","v":{"$error":"#N/A"}},{"$f":"INDIRECT(\"$H$\"&MATCH($R107,$A$15:$A$110,0)+14)+INDIRECT(\"$H$\"&MATCH($R107,$A$15:$A$110,0)+15)+INDIRECT(\"$H$\"&MATCH($R107,$A$15:$A$110,0)+16)+INDIRECT(\"$H$\"&MATCH($R107,$A$15:$A$110,0)+17)+INDIRECT(\"$I$\"&MATCH($R107,$A$15:$A$110,0)+14)+INDIRECT(\"$I$\"&MATCH($R107,$A$15:$A$110,0)+15)+INDIRECT(\"$I$\"&MATCH($R107,$A$15:$A$110,0)+16)+INDIRECT(\"$I$\"&MATCH($R107,$A$15:$A$110,0)+17)","v":{"$error":"#N/A"}},{"$f":"INDIRECT(\"$N$\"&MATCH($R107,$A$15:$A$110,0)+14)+INDIRECT(\"$N$\"&MATCH($R107,$A$15:$A$110,0)+15)+INDIRECT(\"$N$\"&MATCH($R107,$A$15:$A$110,0)+16)+INDIRECT(\"$N$\"&MATCH($R107,$A$15:$A$110,0)+17)+INDIRECT(\"$O$\"&MATCH($R107,$A$15:$A$110,0)+14)+INDIRECT(\"$O$\"&MATCH($R107,$A$15:$A$110,0)+15)+INDIRECT(\"$O$\"&MATCH($R107,$A$15:$A$110,0)+16)+INDIRECT(\"$O$\"&MATCH($R107,$A$15:$A$110,0)+17)","v":{"$error":"#N/A"}},{"$f":"R107","v":"5:00 AM"}]

{"sheet":"E-W Omit RT","index":9,"n_rows":107,"n_cols":23,"rows_kept":107,"cut":false,"hidden":false,"merged":[[12,1,12,4],[12,5,12,8],[12,9,12,12],[12,13,12,16],[12,18,12,22],[9,0,9,1],[9,2,9,16],[10,0,10,1],[10,2,10,16],[11,1,11,4],[11,5,11,8],[11,9,11,12],[11,13,11,16],[6,0,6,1],[6,2,6,16],[7,0,7,1],[7,2,7,16],[8,0,8,1],[8,2,8,16],[3,0,3,1],[3,2,3,16],[4,0,4,1],[4,2,4,16],[5,0,5,1],[5,2,5,16],[0,0,0,1],[0,2,0,16],[1,0,1,1],[1,2,1,16],[2,0,2,1],[2,2,2,16]]}
["Study Name"]
["Start Date"]
["Start Time"]
["Site Code",null,""]
["Project",null,""]
["",null,""]
["",null,""]
["",null,""]
["",null,""]
["Type",null,"Road"]
["Classification",null,"Totals"]
[]
[null,null,null,null,null,null,null,null,null,null,null,null,null,null,null,null,null,null,"Hourly Totals"]
[null,null,null,null,null,null,null,null,null,null,null,null,null,null,null,null,null,null,"EB Left/U-turn","WB Thru","WB Left/U-turn","EB Thru","Start of Hour"]
[null,null,null,null,null,null,null,null,null,null,null,null,null,null,null,null,null,"6:00 AM",{"$f":"INDIRECT(\"$P$\"&MATCH($R15,$A$15:$A$110,0)+14)+INDIRECT(\"$P$\"&MATCH($R15,$A$15:$A$110,0)+15)+INDIRECT(\"$P$\"&MATCH($R15,$A$15:$A$110,0)+16)+INDIRECT(\"$P$\"&MATCH($R15,$A$15:$A$110,0)+17)+INDIRECT(\"$Q$\"&MATCH($R15,$A$15:$A$110,0)+14)+INDIRECT(\"$Q$\"&MATCH($R15,$A$15:$A$110,0)+15)+INDIRECT(\"$Q$\"&MATCH($R15,$A$15:$A$110,0)+16)+INDIRECT(\"$Q$\"&MATCH($R15,$A$15:$A$110,0)+17)","v":{"$error":"#N/A"}},{"$f":"INDIRECT(\"$G$\"&MATCH($R15,$A$15:$A$110,0)+14)+INDIRECT(\"$G$\"&MATCH($R15,$A$15:$A$110,0)+15)+INDIRECT(\"$G$\"&MATCH($R15,$A$15:$A$110,0)+16)+INDIRECT(\"$G$\"&MATCH($R15,$A$15:$A$110,0)+17)","v":{"$error":"#N/A"}},{"$f":"INDIRECT(\"$H$\"&MATCH($R15,$A$15:$A$110,0)+14)+INDIRECT(\"$H$\"&MATCH($R15,$A$15:$A$110,0)+15)+INDIRECT(\"$H$\"&MATCH($R15,$A$15:$A$110,0)+16)+INDIRECT(\"$H$\"&MATCH($R15,$A$15:$A$110,0)+17)+INDIRECT(\"$I$\"&MATCH($R15,$A$15:$A$110,0)+14)+INDIRECT(\"$I$\"&MATCH($R15,$A$15:$A$110,0)+15)+INDIRECT(\"$I$\"&MATCH($R15,$A$15:$A$110,0)+16)+INDIRECT(\"$I$\"&MATCH($R15,$A$15:$A$110,0)+17)","v":{"$error":"#N/A"}},{"$f":"INDIRECT(\"$O$\"&MATCH($R15,$A$15:$A$110,0)+14)+INDIRECT(\"$O$\"&MATCH($R15,$A$15:$A$110,0)+15)+INDIRECT(\"$O$\"&MATCH($R15,$A$15:$A$110,0)+16)+INDIRECT(\"$O$\"&MATCH($R15,$A$15:$A$110,0)+17)","v":{"$error":"#N/A"}},{"$f":"R15","v":"6:00 AM"}]
[]
[]
[]
[null,null,null,null,null,null,null,null,null,null,null,null,null,null,null,null,null,"7:00 AM",{"$f":"INDIRECT(\"$P$\"&MATCH($R19,$A$15:$A$110,0)+14)+INDIRECT(\"$P$\"&MATCH($R19,$A$15:$A$110,0)+15)+INDIRECT(\"$P$\"&MATCH($R19,$A$15:$A$110,0)+16)+INDIRECT(\"$P$\"&MATCH($R19,$A$15:$A$110,0)+17)+INDIRECT(\"$Q$\"&MATCH($R19,$A$15:$A$110,0)+14)+INDIRECT(\"$Q$\"&MATCH($R19,$A$15:$A$110,0)+15)+INDIRECT(\"$Q$\"&MATCH($R19,$A$15:$A$110,0)+16)+INDIRECT(\"$Q$\"&MATCH($R19,$A$15:$A$110,0)+17)","v":{"$error":"#N/A"}},{"$f":"INDIRECT(\"$G$\"&MATCH($R19,$A$15:$A$110,0)+14)+INDIRECT(\"$G$\"&MATCH($R19,$A$15:$A$110,0)+15)+INDIRECT(\"$G$\"&MATCH($R19,$A$15:$A$110,0)+16)+INDIRECT(\"$G$\"&MATCH($R19,$A$15:$A$110,0)+17)","v":{"$error":"#N/A"}},{"$f":"INDIRECT(\"$H$\"&MATCH($R19,$A$15:$A$110,0)+14)+INDIRECT(\"$H$\"&MATCH($R19,$A$15:$A$110,0)+15)+INDIRECT(\"$H$\"&MATCH($R19,$A$15:$A$110,0)+16)+INDIRECT(\"$H$\"&MATCH($R19,$A$15:$A$110,0)+17)+INDIRECT(\"$I$\"&MATCH($R19,$A$15:$A$110,0)+14)+INDIRECT(\"$I$\"&MATCH($R19,$A$15:$A$110,0)+15)+INDIRECT(\"$I$\"&MATCH($R19,$A$15:$A$110,0)+16)+INDIRECT(\"$I$\"&MATCH($R19,$A$15:$A$110,0)+17)","v":{"$error":"#N/A"}},{"$f":"INDIRECT(\"$O$\"&MATCH($R19,$A$15:$A$110,0)+14)+INDIRECT(\"$O$\"&MATCH($R19,$A$15:$A$110,0)+15)+INDIRECT(\"$O$\"&MATCH($R19,$A$15:$A$110,0)+16)+INDIRECT(\"$O$\"&MATCH($R19,$A$15:$A$110,0)+17)","v":{"$error":"#N/A"}},{"$f":"R19","v":"7:00 AM"}]
[]
[]
[]
[null,null,null,null,null,null,null,null,null,null,null,null,null,null,null,null,null,"8:00 AM",{"$f":"INDIRECT(\"$P$\"&MATCH($R23,$A$15:$A$110,0)+14)+INDIRECT(\"$P$\"&MATCH($R23,$A$15:$A$110,0)+15)+INDIRECT(\"$P$\"&MATCH($R23,$A$15:$A$110,0)+16)+INDIRECT(\"$P$\"&MATCH($R23,$A$15:$A$110,0)+17)+INDIRECT(\"$Q$\"&MATCH($R23,$A$15:$A$110,0)+14)+INDIRECT(\"$Q$\"&MATCH($R23,$A$15:$A$110,0)+15)+INDIRECT(\"$Q$\"&MATCH($R23,$A$15:$A$110,0)+16)+INDIRECT(\"$Q$\"&MATCH($R23,$A$15:$A$110,0)+17)","v":{"$error":"#N/A"}},{"$f":"INDIRECT(\"$G$\"&MATCH($R23,$A$15:$A$110,0)+14)+INDIRECT(\"$G$\"&MATCH($R23,$A$15:$A$110,0)+15)+INDIRECT(\"$G$\"&MATCH($R23,$A$15:$A$110,0)+16)+INDIRECT(\"$G$\"&MATCH($R23,$A$15:$A$110,0)+17)","v":{"$error":"#N/A"}},{"$f":"INDIRECT(\"$H$\"&MATCH($R23,$A$15:$A$110,0)+14)+INDIRECT(\"$H$\"&MATCH($R23,$A$15:$A$110,0)+15)+INDIRECT(\"$H$\"&MATCH($R23,$A$15:$A$110,0)+16)+INDIRECT(\"$H$\"&MATCH($R23,$A$15:$A$110,0)+17)+INDIRECT(\"$I$\"&MATCH($R23,$A$15:$A$110,0)+14)+INDIRECT(\"$I$\"&MATCH($R23,$A$15:$A$110,0)+15)+INDIRECT(\"$I$\"&MATCH($R23,$A$15:$A$110,0)+16)+INDIRECT(\"$I$\"&MATCH($R23,$A$15:$A$110,0)+17)","v":{"$error":"#N/A"}},{"$f":"INDIRECT(\"$O$\"&MATCH($R23,$A$15:$A$110,0)+14)+INDIRECT(\"$O$\"&MATCH($R23,$A$15:$A$110,0)+15)+INDIRECT(\"$O$\"&MATCH($R23,$A$15:$A$110,0)+16)+INDIRECT(\"$O$\"&MATCH($R23,$A$15:$A$110,0)+17)","v":{"$error":"#N/A"}},{"$f":"R23","v":"8:00 AM"}]
[]
[]
[]
[null,null,null,null,null,null,null,null,null,null,null,null,null,null,null,null,null,"9:00 AM",{"$f":"INDIRECT(\"$P$\"&MATCH($R27,$A$15:$A$110,0)+14)+INDIRECT(\"$P$\"&MATCH($R27,$A$15:$A$110,0)+15)+INDIRECT(\"$P$\"&MATCH($R27,$A$15:$A$110,0)+16)+INDIRECT(\"$P$\"&MATCH($R27,$A$15:$A$110,0)+17)+INDIRECT(\"$Q$\"&MATCH($R27,$A$15:$A$110,0)+14)+INDIRECT(\"$Q$\"&MATCH($R27,$A$15:$A$110,0)+15)+INDIRECT(\"$Q$\"&MATCH($R27,$A$15:$A$110,0)+16)+INDIRECT(\"$Q$\"&MATCH($R27,$A$15:$A$110,0)+17)","v":{"$error":"#N/A"}},{"$f":"INDIRECT(\"$G$\"&MATCH($R27,$A$15:$A$110,0)+14)+INDIRECT(\"$G$\"&MATCH($R27,$A$15:$A$110,0)+15)+INDIRECT(\"$G$\"&MATCH($R27,$A$15:$A$110,0)+16)+INDIRECT(\"$G$\"&MATCH($R27,$A$15:$A$110,0)+17)","v":{"$error":"#N/A"}},{"$f":"INDIRECT(\"$H$\"&MATCH($R27,$A$15:$A$110,0)+14)+INDIRECT(\"$H$\"&MATCH($R27,$A$15:$A$110,0)+15)+INDIRECT(\"$H$\"&MATCH($R27,$A$15:$A$110,0)+16)+INDIRECT(\"$H$\"&MATCH($R27,$A$15:$A$110,0)+17)+INDIRECT(\"$I$\"&MATCH($R27,$A$15:$A$110,0)+14)+INDIRECT(\"$I$\"&MATCH($R27,$A$15:$A$110,0)+15)+INDIRECT(\"$I$\"&MATCH($R27,$A$15:$A$110,0)+16)+INDIRECT(\"$I$\"&MATCH($R27,$A$15:$A$110,0)+17)","v":{"$error":"#N/A"}},{"$f":"INDIRECT(\"$O$\"&MATCH($R27,$A$15:$A$110,0)+14)+INDIRECT(\"$O$\"&MATCH($R27,$A$15:$A$110,0)+15)+INDIRECT(\"$O$\"&MATCH($R27,$A$15:$A$110,0)+16)+INDIRECT(\"$O$\"&MATCH($R27,$A$15:$A$110,0)+17)","v":{"$error":"#N/A"}},{"$f":"R27","v":"9:00 AM"}]
[]
[]
[]
[null,null,null,null,null,null,null,null,null,null,null,null,null,null,null,null,null,"10:00 AM",{"$f":"INDIRECT(\"$P$\"&MATCH($R31,$A$15:$A$110,0)+14)+INDIRECT(\"$P$\"&MATCH($R31,$A$15:$A$110,0)+15)+INDIRECT(\"$P$\"&MATCH($R31,$A$15:$A$110,0)+16)+INDIRECT(\"$P$\"&MATCH($R31,$A$15:$A$110,0)+17)+INDIRECT(\"$Q$\"&MATCH($R31,$A$15:$A$110,0)+14)+INDIRECT(\"$Q$\"&MATCH($R31,$A$15:$A$110,0)+15)+INDIRECT(\"$Q$\"&MATCH($R31,$A$15:$A$110,0)+16)+INDIRECT(\"$Q$\"&MATCH($R31,$A$15:$A$110,0)+17)","v":{"$error":"#N/A"}},{"$f":"INDIRECT(\"$G$\"&MATCH($R31,$A$15:$A$110,0)+14)+INDIRECT(\"$G$\"&MATCH($R31,$A$15:$A$110,0)+15)+INDIRECT(\"$G$\"&MATCH($R31,$A$15:$A$110,0)+16)+INDIRECT(\"$G$\"&MATCH($R31,$A$15:$A$110,0)+17)","v":{"$error":"#N/A"}},{"$f":"INDIRECT(\"$H$\"&MATCH($R31,$A$15:$A$110,0)+14)+INDIRECT(\"$H$\"&MATCH($R31,$A$15:$A$110,0)+15)+INDIRECT(\"$H$\"&MATCH($R31,$A$15:$A$110,0)+16)+INDIRECT(\"$H$\"&MATCH($R31,$A$15:$A$110,0)+17)+INDIRECT(\"$I$\"&MATCH($R31,$A$15:$A$110,0)+14)+INDIRECT(\"$I$\"&MATCH($R31,$A$15:$A$110,0)+15)+INDIRECT(\"$I$\"&MATCH($R31,$A$15:$A$110,0)+16)+INDIRECT(\"$I$\"&MATCH($R31,$A$15:$A$110,0)+17)","v":{"$error":"#N/A"}},{"$f":"INDIRECT(\"$O$\"&MATCH($R31,$A$15:$A$110,0)+14)+INDIRECT(\"$O$\"&MATCH($R31,$A$15:$A$110,0)+15)+INDIRECT(\"$O$\"&MATCH($R31,$A$15:$A$110,0)+16)+INDIRECT(\"$O$\"&MATCH($R31,$A$15:$A$110,0)+17)","v":{"$error":"#N/A"}},{"$f":"R31","v":"10:00 AM"}]
[]
[]
[]
[null,null,null,null,null,null,null,null,null,null,null,null,null,null,null,null,null,"11:00 AM",{"$f":"INDIRECT(\"$P$\"&MATCH($R35,$A$15:$A$110,0)+14)+INDIRECT(\"$P$\"&MATCH($R35,$A$15:$A$110,0)+15)+INDIRECT(\"$P$\"&MATCH($R35,$A$15:$A$110,0)+16)+INDIRECT(\"$P$\"&MATCH($R35,$A$15:$A$110,0)+17)+INDIRECT(\"$Q$\"&MATCH($R35,$A$15:$A$110,0)+14)+INDIRECT(\"$Q$\"&MATCH($R35,$A$15:$A$110,0)+15)+INDIRECT(\"$Q$\"&MATCH($R35,$A$15:$A$110,0)+16)+INDIRECT(\"$Q$\"&MATCH($R35,$A$15:$A$110,0)+17)","v":{"$error":"#N/A"}},{"$f":"INDIRECT(\"$G$\"&MATCH($R35,$A$15:$A$110,0)+14)+INDIRECT(\"$G$\"&MATCH($R35,$A$15:$A$110,0)+15)+INDIRECT(\"$G$\"&MATCH($R35,$A$15:$A$110,0)+16)+INDIRECT(\"$G$\"&MATCH($R35,$A$15:$A$110,0)+17)","v":{"$error":"#N/A"}},{"$f":"INDIRECT(\"$H$\"&MATCH($R35,$A$15:$A$110,0)+14)+INDIRECT(\"$H$\"&MATCH($R35,$A$15:$A$110,0)+15)+INDIRECT(\"$H$\"&MATCH($R35,$A$15:$A$110,0)+16)+INDIRECT(\"$H$\"&MATCH($R35,$A$15:$A$110,0)+17)+INDIRECT(\"$I$\"&MATCH($R35,$A$15:$A$110,0)+14)+INDIRECT(\"$I$\"&MATCH($R35,$A$15:$A$110,0)+15)+INDIRECT(\"$I$\"&MATCH($R35,$A$15:$A$110,0)+16)+INDIRECT(\"$I$\"&MATCH($R35,$A$15:$A$110,0)+17)","v":{"$error":"#N/A"}},{"$f":"INDIRECT(\"$O$\"&MATCH($R35,$A$15:$A$110,0)+14)+INDIRECT(\"$O$\"&MATCH($R35,$A$15:$A$110,0)+15)+INDIRECT(\"$O$\"&MATCH($R35,$A$15:$A$110,0)+16)+INDIRECT(\"$O$\"&MATCH($R35,$A$15:$A$110,0)+17)","v":{"$error":"#N/A"}},{"$f":"R35","v":"11:00 AM"}]
[]
[]
[]
[null,null,null,null,null,null,null,null,null,null,null,null,null,null,null,null,null,"12:00 PM",{"$f":"INDIRECT(\"$P$\"&MATCH($R39,$A$15:$A$110,0)+14)+INDIRECT(\"$P$\"&MATCH($R39,$A$15:$A$110,0)+15)+INDIRECT(\"$P$\"&MATCH($R39,$A$15:$A$110,0)+16)+INDIRECT(\"$P$\"&MATCH($R39,$A$15:$A$110,0)+17)+INDIRECT(\"$Q$\"&MATCH($R39,$A$15:$A$110,0)+14)+INDIRECT(\"$Q$\"&MATCH($R39,$A$15:$A$110,0)+15)+INDIRECT(\"$Q$\"&MATCH($R39,$A$15:$A$110,0)+16)+INDIRECT(\"$Q$\"&MATCH($R39,$A$15:$A$110,0)+17)","v":{"$error":"#N/A"}},{"$f":"INDIRECT(\"$G$\"&MATCH($R39,$A$15:$A$110,0)+14)+INDIRECT(\"$G$\"&MATCH($R39,$A$15:$A$110,0)+15)+INDIRECT(\"$G$\"&MATCH($R39,$A$15:$A$110,0)+16)+INDIRECT(\"$G$\"&MATCH($R39,$A$15:$A$110,0)+17)","v":{"$error":"#N/A"}},{"$f":"INDIRECT(\"$H$\"&MATCH($R39,$A$15:$A$110,0)+14)+INDIRECT(\"$H$\"&MATCH($R39,$A$15:$A$110,0)+15)+INDIRECT(\"$H$\"&MATCH($R39,$A$15:$A$110,0)+16)+INDIRECT(\"$H$\"&MATCH($R39,$A$15:$A$110,0)+17)+INDIRECT(\"$I$\"&MATCH($R39,$A$15:$A$110,0)+14)+INDIRECT(\"$I$\"&MATCH($R39,$A$15:$A$110,0)+15)+INDIRECT(\"$I$\"&MATCH($R39,$A$15:$A$110,0)+16)+INDIRECT(\"$I$\"&MATCH($R39,$A$15:$A$110,0)+17)","v":{"$error":"#N/A"}},{"$f":"INDIRECT(\"$O$\"&MATCH($R39,$A$15:$A$110,0)+14)+INDIRECT(\"$O$\"&MATCH($R39,$A$15:$A$110,0)+15)+INDIRECT(\"$O$\"&MATCH($R39,$A$15:$A$110,0)+16)+INDIRECT(\"$O$\"&MATCH($R39,$A$15:$A$110,0)+17)","v":{"$error":"#N/A"}},{"$f":"R39","v":"12:00 PM"}]
[]
[]
[]
[null,null,null,null,null,null,null,null,null,null,null,null,null,null,null,null,null,"1:00 PM",{"$f":"INDIRECT(\"$P$\"&MATCH($R43,$A$15:$A$110,0)+14)+INDIRECT(\"$P$\"&MATCH($R43,$A$15:$A$110,0)+15)+INDIRECT(\"$P$\"&MATCH($R43,$A$15:$A$110,0)+16)+INDIRECT(\"$P$\"&MATCH($R43,$A$15:$A$110,0)+17)+INDIRECT(\"$Q$\"&MATCH($R43,$A$15:$A$110,0)+14)+INDIRECT(\"$Q$\"&MATCH($R43,$A$15:$A$110,0)+15)+INDIRECT(\"$Q$\"&MATCH($R43,$A$15:$A$110,0)+16)+INDIRECT(\"$Q$\"&MATCH($R43,$A$15:$A$110,0)+17)","v":{"$error":"#N/A"}},{"$f":"INDIRECT(\"$G$\"&MATCH($R43,$A$15:$A$110,0)+14)+INDIRECT(\"$G$\"&MATCH($R43,$A$15:$A$110,0)+15)+INDIRECT(\"$G$\"&MATCH($R43,$A$15:$A$110,0)+16)+INDIRECT(\"$G$\"&MATCH($R43,$A$15:$A$110,0)+17)","v":{"$error":"#N/A"}},{"$f":"INDIRECT(\"$H$\"&MATCH($R43,$A$15:$A$110,0)+14)+INDIRECT(\"$H$\"&MATCH($R43,$A$15:$A$110,0)+15)+INDIRECT(\"$H$\"&MATCH($R43,$A$15:$A$110,0)+16)+INDIRECT(\"$H$\"&MATCH($R43,$A$15:$A$110,0)+17)+INDIRECT(\"$I$\"&MATCH($R43,$A$15:$A$110,0)+14)+INDIRECT(\"$I$\"&MATCH($R43,$A$15:$A$110,0)+15)+INDIRECT(\"$I$\"&MATCH($R43,$A$15:$A$110,0)+16)+INDIRECT(\"$I$\"&MATCH($R43,$A$15:$A$110,0)+17)","v":{"$error":"#N/A"}},{"$f":"INDIRECT(\"$O$\"&MATCH($R43,$A$15:$A$110,0)+14)+INDIRECT(\"$O$\"&MATCH($R43,$A$15:$A$110,0)+15)+INDIRECT(\"$O$\"&MATCH($R43,$A$15:$A$110,0)+16)+INDIRECT(\"$O$\"&MATCH($R43,$A$15:$A$110,0)+17)","v":{"$error":"#N/A"}},{"$f":"R43","v":"1:00 PM"}]
[]
[]
[]
[null,null,null,null,null,null,null,null,null,null,null,null,null,null,null,null,null,"2:00 PM",{"$f":"INDIRECT(\"$P$\"&MATCH($R47,$A$15:$A$110,0)+14)+INDIRECT(\"$P$\"&MATCH($R47,$A$15:$A$110,0)+15)+INDIRECT(\"$P$\"&MATCH($R47,$A$15:$A$110,0)+16)+INDIRECT(\"$P$\"&MATCH($R47,$A$15:$A$110,0)+17)+INDIRECT(\"$Q$\"&MATCH($R47,$A$15:$A$110,0)+14)+INDIRECT(\"$Q$\"&MATCH($R47,$A$15:$A$110,0)+15)+INDIRECT(\"$Q$\"&MATCH($R47,$A$15:$A$110,0)+16)+INDIRECT(\"$Q$\"&MATCH($R47,$A$15:$A$110,0)+17)","v":{"$error":"#N/A"}},{"$f":"INDIRECT(\"$G$\"&MATCH($R47,$A$15:$A$110,0)+14)+INDIRECT(\"$G$\"&MATCH($R47,$A$15:$A$110,0)+15)+INDIRECT(\"$G$\"&MATCH($R47,$A$15:$A$110,0)+16)+INDIRECT(\"$G$\"&MATCH($R47,$A$15:$A$110,0)+17)","v":{"$error":"#N/A"}},{"$f":"INDIRECT(\"$H$\"&MATCH($R47,$A$15:$A$110,0)+14)+INDIRECT(\"$H$\"&MATCH($R47,$A$15:$A$110,0)+15)+INDIRECT(\"$H$\"&MATCH($R47,$A$15:$A$110,0)+16)+INDIRECT(\"$H$\"&MATCH($R47,$A$15:$A$110,0)+17)+INDIRECT(\"$I$\"&MATCH($R47,$A$15:$A$110,0)+14)+INDIRECT(\"$I$\"&MATCH($R47,$A$15:$A$110,0)+15)+INDIRECT(\"$I$\"&MATCH($R47,$A$15:$A$110,0)+16)+INDIRECT(\"$I$\"&MATCH($R47,$A$15:$A$110,0)+17)","v":{"$error":"#N/A"}},{"$f":"INDIRECT(\"$O$\"&MATCH($R47,$A$15:$A$110,0)+14)+INDIRECT(\"$O$\"&MATCH($R47,$A$15:$A$110,0)+15)+INDIRECT(\"$O$\"&MATCH($R47,$A$15:$A$110,0)+16)+INDIRECT(\"$O$\"&MATCH($R47,$A$15:$A$110,0)+17)","v":{"$error":"#N/A"}},{"$f":"R47","v":"2:00 PM"}]
[]
[]
[]
[null,null,null,null,null,null,null,null,null,null,null,null,null,null,null,null,null,"3:00 PM",{"$f":"INDIRECT(\"$P$\"&MATCH($R51,$A$15:$A$110,0)+14)+INDIRECT(\"$P$\"&MATCH($R51,$A$15:$A$110,0)+15)+INDIRECT(\"$P$\"&MATCH($R51,$A$15:$A$110,0)+16)+INDIRECT(\"$P$\"&MATCH($R51,$A$15:$A$110,0)+17)+INDIRECT(\"$Q$\"&MATCH($R51,$A$15:$A$110,0)+14)+INDIRECT(\"$Q$\"&MATCH($R51,$A$15:$A$110,0)+15)+INDIRECT(\"$Q$\"&MATCH($R51,$A$15:$A$110,0)+16)+INDIRECT(\"$Q$\"&MATCH($R51,$A$15:$A$110,0)+17)","v":{"$error":"#N/A"}},{"$f":"INDIRECT(\"$G$\"&MATCH($R51,$A$15:$A$110,0)+14)+INDIRECT(\"$G$\"&MATCH($R51,$A$15:$A$110,0)+15)+INDIRECT(\"$G$\"&MATCH($R51,$A$15:$A$110,0)+16)+INDIRECT(\"$G$\"&MATCH($R51,$A$15:$A$110,0)+17)","v":{"$error":"#N/A"}},{"$f":"INDIRECT(\"$H$\"&MATCH($R51,$A$15:$A$110,0)+14)+INDIRECT(\"$H$\"&MATCH($R51,$A$15:$A$110,0)+15)+INDIRECT(\"$H$\"&MATCH($R51,$A$15:$A$110,0)+16)+INDIRECT(\"$H$\"&MATCH($R51,$A$15:$A$110,0)+17)+INDIRECT(\"$I$\"&MATCH($R51,$A$15:$A$110,0)+14)+INDIRECT(\"$I$\"&MATCH($R51,$A$15:$A$110,0)+15)+INDIRECT(\"$I$\"&MATCH($R51,$A$15:$A$110,0)+16)+INDIRECT(\"$I$\"&MATCH($R51,$A$15:$A$110,0)+17)","v":{"$error":"#N/A"}},{"$f":"INDIRECT(\"$O$\"&MATCH($R51,$A$15:$A$110,0)+14)+INDIRECT(\"$O$\"&MATCH($R51,$A$15:$A$110,0)+15)+INDIRECT(\"$O$\"&MATCH($R51,$A$15:$A$110,0)+16)+INDIRECT(\"$O$\"&MATCH($R51,$A$15:$A$110,0)+17)","v":{"$error":"#N/A"}},{"$f":"R51","v":"3:00 PM"}]
[]
[]
[]
[null,null,null,null,null,null,null,null,null,null,null,null,null,null,null,null,null,"4:00 PM",{"$f":"INDIRECT(\"$P$\"&MATCH($R55,$A$15:$A$110,0)+14)+INDIRECT(\"$P$\"&MATCH($R55,$A$15:$A$110,0)+15)+INDIRECT(\"$P$\"&MATCH($R55,$A$15:$A$110,0)+16)+INDIRECT(\"$P$\"&MATCH($R55,$A$15:$A$110,0)+17)+INDIRECT(\"$Q$\"&MATCH($R55,$A$15:$A$110,0)+14)+INDIRECT(\"$Q$\"&MATCH($R55,$A$15:$A$110,0)+15)+INDIRECT(\"$Q$\"&MATCH($R55,$A$15:$A$110,0)+16)+INDIRECT(\"$Q$\"&MATCH($R55,$A$15:$A$110,0)+17)","v":{"$error":"#N/A"}},{"$f":"INDIRECT(\"$G$\"&MATCH($R55,$A$15:$A$110,0)+14)+INDIRECT(\"$G$\"&MATCH($R55,$A$15:$A$110,0)+15)+INDIRECT(\"$G$\"&MATCH($R55,$A$15:$A$110,0)+16)+INDIRECT(\"$G$\"&MATCH($R55,$A$15:$A$110,0)+17)","v":{"$error":"#N/A"}},{"$f":"INDIRECT(\"$H$\"&MATCH($R55,$A$15:$A$110,0)+14)+INDIRECT(\"$H$\"&MATCH($R55,$A$15:$A$110,0)+15)+INDIRECT(\"$H$\"&MATCH($R55,$A$15:$A$110,0)+16)+INDIRECT(\"$H$\"&MATCH($R55,$A$15:$A$110,0)+17)+INDIRECT(\"$I$\"&MATCH($R55,$A$15:$A$110,0)+14)+INDIRECT(\"$I$\"&MATCH($R55,$A$15:$A$110,0)+15)+INDIRECT(\"$I$\"&MATCH($R55,$A$15:$A$110,0)+16)+INDIRECT(\"$I$\"&MATCH($R55,$A$15:$A$110,0)+17)","v":{"$error":"#N/A"}},{"$f":"INDIRECT(\"$O$\"&MATCH($R55,$A$15:$A$110,0)+14)+INDIRECT(\"$O$\"&MATCH($R55,$A$15:$A$110,0)+15)+INDIRECT(\"$O$\"&MATCH($R55,$A$15:$A$110,0)+16)+INDIRECT(\"$O$\"&MATCH($R55,$A$15:$A$110,0)+17)","v":{"$error":"#N/A"}},{"$f":"R55","v":"4:00 PM"}]
[]
[]
[]
[null,null,null,null,null,null,null,null,null,null,null,null,null,null,null,null,null,"5:00 PM",{"$f":"INDIRECT(\"$P$\"&MATCH($R59,$A$15:$A$110,0)+14)+INDIRECT(\"$P$\"&MATCH($R59,$A$15:$A$110,0)+15)+INDIRECT(\"$P$\"&MATCH($R59,$A$15:$A$110,0)+16)+INDIRECT(\"$P$\"&MATCH($R59,$A$15:$A$110,0)+17)+INDIRECT(\"$Q$\"&MATCH($R59,$A$15:$A$110,0)+14)+INDIRECT(\"$Q$\"&MATCH($R59,$A$15:$A$110,0)+15)+INDIRECT(\"$Q$\"&MATCH($R59,$A$15:$A$110,0)+16)+INDIRECT(\"$Q$\"&MATCH($R59,$A$15:$A$110,0)+17)","v":{"$error":"#N/A"}},{"$f":"INDIRECT(\"$G$\"&MATCH($R59,$A$15:$A$110,0)+14)+INDIRECT(\"$G$\"&MATCH($R59,$A$15:$A$110,0)+15)+INDIRECT(\"$G$\"&MATCH($R59,$A$15:$A$110,0)+16)+INDIRECT(\"$G$\"&MATCH($R59,$A$15:$A$110,0)+17)","v":{"$error":"#N/A"}},{"$f":"INDIRECT(\"$H$\"&MATCH($R59,$A$15:$A$110,0)+14)+INDIRECT(\"$H$\"&MATCH($R59,$A$15:$A$110,0)+15)+INDIRECT(\"$H$\"&MATCH($R59,$A$15:$A$110,0)+16)+INDIRECT(\"$H$\"&MATCH($R59,$A$15:$A$110,0)+17)+INDIRECT(\"$I$\"&MATCH($R59,$A$15:$A$110,0)+14)+INDIRECT(\"$I$\"&MATCH($R59,$A$15:$A$110,0)+15)+INDIRECT(\"$I$\"&MATCH($R59,$A$15:$A$110,0)+16)+INDIRECT(\"$I$\"&MATCH($R59,$A$15:$A$110,0)+17)","v":{"$error":"#N/A"}},{"$f":"INDIRECT(\"$O$\"&MATCH($R59,$A$15:$A$110,0)+14)+INDIRECT(\"$O$\"&MATCH($R59,$A$15:$A$110,0)+15)+INDIRECT(\"$O$\"&MATCH($R59,$A$15:$A$110,0)+16)+INDIRECT(\"$O$\"&MATCH($R59,$A$15:$A$110,0)+17)","v":{"$error":"#N/A"}},{"$f":"R59","v":"5:00 PM"}]
[]
[]
[]
[null,null,null,null,null,null,null,null,null,null,null,null,null,null,null,null,null,"6:00 PM",{"$f":"INDIRECT(\"$P$\"&MATCH($R63,$A$15:$A$110,0)+14)+INDIRECT(\"$P$\"&MATCH($R63,$A$15:$A$110,0)+15)+INDIRECT(\"$P$\"&MATCH($R63,$A$15:$A$110,0)+16)+INDIRECT(\"$P$\"&MATCH($R63,$A$15:$A$110,0)+17)+INDIRECT(\"$Q$\"&MATCH($R63,$A$15:$A$110,0)+14)+INDIRECT(\"$Q$\"&MATCH($R63,$A$15:$A$110,0)+15)+INDIRECT(\"$Q$\"&MATCH($R63,$A$15:$A$110,0)+16)+INDIRECT(\"$Q$\"&MATCH($R63,$A$15:$A$110,0)+17)","v":{"$error":"#N/A"}},{"$f":"INDIRECT(\"$G$\"&MATCH($R63,$A$15:$A$110,0)+14)+INDIRECT(\"$G$\"&MATCH($R63,$A$15:$A$110,0)+15)+INDIRECT(\"$G$\"&MATCH($R63,$A$15:$A$110,0)+16)+INDIRECT(\"$G$\"&MATCH($R63,$A$15:$A$110,0)+17)","v":{"$error":"#N/A"}},{"$f":"INDIRECT(\"$H$\"&MATCH($R63,$A$15:$A$110,0)+14)+INDIRECT(\"$H$\"&MATCH($R63,$A$15:$A$110,0)+15)+INDIRECT(\"$H$\"&MATCH($R63,$A$15:$A$110,0)+16)+INDIRECT(\"$H$\"&MATCH($R63,$A$15:$A$110,0)+17)+INDIRECT(\"$I$\"&MATCH($R63,$A$15:$A$110,0)+14)+INDIRECT(\"$I$\"&MATCH($R63,$A$15:$A$110,0)+15)+INDIRECT(\"$I$\"&MATCH($R63,$A$15:$A$110,0)+16)+INDIRECT(\"$I$\"&MATCH($R63,$A$15:$A$110,0)+17)","v":{"$error":"#N/A"}},{"$f":"INDIRECT(\"$O$\"&MATCH($R63,$A$15:$A$110,0)+14)+INDIRECT(\"$O$\"&MATCH($R63,$A$15:$A$110,0)+15)+INDIRECT(\"$O$\"&MATCH($R63,$A$15:$A$110,0)+16)+INDIRECT(\"$O$\"&MATCH($R63,$A$15:$A$110,0)+17)","v":{"$error":"#N/A"}},{"$f":"R63","v":"6:00 PM"}]
[]
[]
[]
[null,null,null,null,null,null,null,null,null,null,null,null,null,null,null,null,null,"7:00 PM",{"$f":"INDIRECT(\"$P$\"&MATCH($R67,$A$15:$A$110,0)+14)+INDIRECT(\"$P$\"&MATCH($R67,$A$15:$A$110,0)+15)+INDIRECT(\"$P$\"&MATCH($R67,$A$15:$A$110,0)+16)+INDIRECT(\"$P$\"&MATCH($R67,$A$15:$A$110,0)+17)+INDIRECT(\"$Q$\"&MATCH($R67,$A$15:$A$110,0)+14)+INDIRECT(\"$Q$\"&MATCH($R67,$A$15:$A$110,0)+15)+INDIRECT(\"$Q$\"&MATCH($R67,$A$15:$A$110,0)+16)+INDIRECT(\"$Q$\"&MATCH($R67,$A$15:$A$110,0)+17)","v":{"$error":"#N/A"}},{"$f":"INDIRECT(\"$G$\"&MATCH($R67,$A$15:$A$110,0)+14)+INDIRECT(\"$G$\"&MATCH($R67,$A$15:$A$110,0)+15)+INDIRECT(\"$G$\"&MATCH($R67,$A$15:$A$110,0)+16)+INDIRECT(\"$G$\"&MATCH($R67,$A$15:$A$110,0)+17)","v":{"$error":"#N/A"}},{"$f":"INDIRECT(\"$H$\"&MATCH($R67,$A$15:$A$110,0)+14)+INDIRECT(\"$H$\"&MATCH($R67,$A$15:$A$110,0)+15)+INDIRECT(\"$H$\"&MATCH($R67,$A$15:$A$110,0)+16)+INDIRECT(\"$H$\"&MATCH($R67,$A$15:$A$110,0)+17)+INDIRECT(\"$I$\"&MATCH($R67,$A$15:$A$110,0)+14)+INDIRECT(\"$I$\"&MATCH($R67,$A$15:$A$110,0)+15)+INDIRECT(\"$I$\"&MATCH($R67,$A$15:$A$110,0)+16)+INDIRECT(\"$I$\"&MATCH($R67,$A$15:$A$110,0)+17)","v":{"$error":"#N/A"}},{"$f":"INDIRECT(\"$O$\"&MATCH($R67,$A$15:$A$110,0)+14)+INDIRECT(\"$O$\"&MATCH($R67,$A$15:$A$110,0)+15)+INDIRECT(\"$O$\"&MATCH($R67,$A$15:$A$110,0)+16)+INDIRECT(\"$O$\"&MATCH($R67,$A$15:$A$110,0)+17)","v":{"$error":"#N/A"}},{"$f":"R67","v":"7:00 PM"}]
[]
[]
[]
[null,null,null,null,null,null,null,null,null,null,null,null,null,null,null,null,null,"8:00 PM",{"$f":"INDIRECT(\"$P$\"&MATCH($R71,$A$15:$A$110,0)+14)+INDIRECT(\"$P$\"&MATCH($R71,$A$15:$A$110,0)+15)+INDIRECT(\"$P$\"&MATCH($R71,$A$15:$A$110,0)+16)+INDIRECT(\"$P$\"&MATCH($R71,$A$15:$A$110,0)+17)+INDIRECT(\"$Q$\"&MATCH($R71,$A$15:$A$110,0)+14)+INDIRECT(\"$Q$\"&MATCH($R71,$A$15:$A$110,0)+15)+INDIRECT(\"$Q$\"&MATCH($R71,$A$15:$A$110,0)+16)+INDIRECT(\"$Q$\"&MATCH($R71,$A$15:$A$110,0)+17)","v":{"$error":"#N/A"}},{"$f":"INDIRECT(\"$G$\"&MATCH($R71,$A$15:$A$110,0)+14)+INDIRECT(\"$G$\"&MATCH($R71,$A$15:$A$110,0)+15)+INDIRECT(\"$G$\"&MATCH($R71,$A$15:$A$110,0)+16)+INDIRECT(\"$G$\"&MATCH($R71,$A$15:$A$110,0)+17)","v":{"$error":"#N/A"}},{"$f":"INDIRECT(\"$H$\"&MATCH($R71,$A$15:$A$110,0)+14)+INDIRECT(\"$H$\"&MATCH($R71,$A$15:$A$110,0)+15)+INDIRECT(\"$H$\"&MATCH($R71,$A$15:$A$110,0)+16)+INDIRECT(\"$H$\"&MATCH($R71,$A$15:$A$110,0)+17)+INDIRECT(\"$I$\"&MATCH($R71,$A$15:$A$110,0)+14)+INDIRECT(\"$I$\"&MATCH($R71,$A$15:$A$110,0)+15)+INDIRECT(\"$I$\"&MATCH($R71,$A$15:$A$110,0)+16)+INDIRECT(\"$I$\"&MATCH($R71,$A$15:$A$110,0)+17)","v":{"$error":"#N/A"}},{"$f":"INDIRECT(\"$O$\"&MATCH($R71,$A$15:$A$110,0)+14)+INDIRECT(\"$O$\"&MATCH($R71,$A$15:$A$110,0)+15)+INDIRECT(\"$O$\"&MATCH($R71,$A$15:$A$110,0)+16)+INDIRECT(\"$O$\"&MATCH($R71,$A$15:$A$110,0)+17)","v":{"$error":"#N/A"}},{"$f":"R71","v":"8:00 PM"}]
[]
[]
[]
[null,null,null,null,null,null,null,null,null,null,null,null,null,null,null,null,null,"9:00 PM",{"$f":"INDIRECT(\"$P$\"&MATCH($R75,$A$15:$A$110,0)+14)+INDIRECT(\"$P$\"&MATCH($R75,$A$15:$A$110,0)+15)+INDIRECT(\"$P$\"&MATCH($R75,$A$15:$A$110,0)+16)+INDIRECT(\"$P$\"&MATCH($R75,$A$15:$A$110,0)+17)+INDIRECT(\"$Q$\"&MATCH($R75,$A$15:$A$110,0)+14)+INDIRECT(\"$Q$\"&MATCH($R75,$A$15:$A$110,0)+15)+INDIRECT(\"$Q$\"&MATCH($R75,$A$15:$A$110,0)+16)+INDIRECT(\"$Q$\"&MATCH($R75,$A$15:$A$110,0)+17)","v":{"$error":"#N/A"}},{"$f":"INDIRECT(\"$G$\"&MATCH($R75,$A$15:$A$110,0)+14)+INDIRECT(\"$G$\"&MATCH($R75,$A$15:$A$110,0)+15)+INDIRECT(\"$G$\"&MATCH($R75,$A$15:$A$110,0)+16)+INDIRECT(\"$G$\"&MATCH($R75,$A$15:$A$110,0)+17)","v":{"$error":"#N/A"}},{"$f":"INDIRECT(\"$H$\"&MATCH($R75,$A$15:$A$110,0)+14)+INDIRECT(\"$H$\"&MATCH($R75,$A$15:$A$110,0)+15)+INDIRECT(\"$H$\"&MATCH($R75,$A$15:$A$110,0)+16)+INDIRECT(\"$H$\"&MATCH($R75,$A$15:$A$110,0)+17)+INDIRECT(\"$I$\"&MATCH($R75,$A$15:$A$110,0)+14)+INDIRECT(\"$I$\"&MATCH($R75,$A$15:$A$110,0)+15)+INDIRECT(\"$I$\"&MATCH($R75,$A$15:$A$110,0)+16)+INDIRECT(\"$I$\"&MATCH($R75,$A$15:$A$110,0)+17)","v":{"$error":"#N/A"}},{"$f":"INDIRECT(\"$O$\"&MATCH($R75,$A$15:$A$110,0)+14)+INDIRECT(\"$O$\"&MATCH($R75,$A$15:$A$110,0)+15)+INDIRECT(\"$O$\"&MATCH($R75,$A$15:$A$110,0)+16)+INDIRECT(\"$O$\"&MATCH($R75,$A$15:$A$110,0)+17)","v":{"$error":"#N/A"}},{"$f":"R75","v":"9:00 PM"}]
[]
[]
[]
[null,null,null,null,null,null,null,null,null,null,null,null,null,null,null,null,null,"10:00 PM",{"$f":"INDIRECT(\"$P$\"&MATCH($R79,$A$15:$A$110,0)+14)+INDIRECT(\"$P$\"&MATCH($R79,$A$15:$A$110,0)+15)+INDIRECT(\"$P$\"&MATCH($R79,$A$15:$A$110,0)+16)+INDIRECT(\"$P$\"&MATCH($R79,$A$15:$A$110,0)+17)+INDIRECT(\"$Q$\"&MATCH($R79,$A$15:$A$110,0)+14)+INDIRECT(\"$Q$\"&MATCH($R79,$A$15:$A$110,0)+15)+INDIRECT(\"$Q$\"&MATCH($R79,$A$15:$A$110,0)+16)+INDIRECT(\"$Q$\"&MATCH($R79,$A$15:$A$110,0)+17)","v":{"$error":"#N/A"}},{"$f":"INDIRECT(\"$G$\"&MATCH($R79,$A$15:$A$110,0)+14)+INDIRECT(\"$G$\"&MATCH($R79,$A$15:$A$110,0)+15)+INDIRECT(\"$G$\"&MATCH($R79,$A$15:$A$110,0)+16)+INDIRECT(\"$G$\"&MATCH($R79,$A$15:$A$110,0)+17)","v":{"$error":"#N/A"}},{"$f":"INDIRECT(\"$H$\"&MATCH($R79,$A$15:$A$110,0)+14)+INDIRECT(\"$H$\"&MATCH($R79,$A$15:$A$110,0)+15)+INDIRECT(\"$H$\"&MATCH($R79,$A$15:$A$110,0)+16)+INDIRECT(\"$H$\"&MATCH($R79,$A$15:$A$110,0)+17)+INDIRECT(\"$I$\"&MATCH($R79,$A$15:$A$110,0)+14)+INDIRECT(\"$I$\"&MATCH($R79,$A$15:$A$110,0)+15)+INDIRECT(\"$I$\"&MATCH($R79,$A$15:$A$110,0)+16)+INDIRECT(\"$I$\"&MATCH($R79,$A$15:$A$110,0)+17)","v":{"$error":"#N/A"}},{"$f":"INDIRECT(\"$O$\"&MATCH($R79,$A$15:$A$110,0)+14)+INDIRECT(\"$O$\"&MATCH($R79,$A$15:$A$110,0)+15)+INDIRECT(\"$O$\"&MATCH($R79,$A$15:$A$110,0)+16)+INDIRECT(\"$O$\"&MATCH($R79,$A$15:$A$110,0)+17)","v":{"$error":"#N/A"}},{"$f":"R79","v":"10:00 PM"}]
[]
[]
[]
[null,null,null,null,null,null,null,null,null,null,null,null,null,null,null,null,null,"11:00 PM",{"$f":"INDIRECT(\"$P$\"&MATCH($R83,$A$15:$A$110,0)+14)+INDIRECT(\"$P$\"&MATCH($R83,$A$15:$A$110,0)+15)+INDIRECT(\"$P$\"&MATCH($R83,$A$15:$A$110,0)+16)+INDIRECT(\"$P$\"&MATCH($R83,$A$15:$A$110,0)+17)+INDIRECT(\"$Q$\"&MATCH($R83,$A$15:$A$110,0)+14)+INDIRECT(\"$Q$\"&MATCH($R83,$A$15:$A$110,0)+15)+INDIRECT(\"$Q$\"&MATCH($R83,$A$15:$A$110,0)+16)+INDIRECT(\"$Q$\"&MATCH($R83,$A$15:$A$110,0)+17)","v":{"$error":"#N/A"}},{"$f":"INDIRECT(\"$G$\"&MATCH($R83,$A$15:$A$110,0)+14)+INDIRECT(\"$G$\"&MATCH($R83,$A$15:$A$110,0)+15)+INDIRECT(\"$G$\"&MATCH($R83,$A$15:$A$110,0)+16)+INDIRECT(\"$G$\"&MATCH($R83,$A$15:$A$110,0)+17)","v":{"$error":"#N/A"}},{"$f":"INDIRECT(\"$H$\"&MATCH($R83,$A$15:$A$110,0)+14)+INDIRECT(\"$H$\"&MATCH($R83,$A$15:$A$110,0)+15)+INDIRECT(\"$H$\"&MATCH($R83,$A$15:$A$110,0)+16)+INDIRECT(\"$H$\"&MATCH($R83,$A$15:$A$110,0)+17)+INDIRECT(\"$I$\"&MATCH($R83,$A$15:$A$110,0)+14)+INDIRECT(\"$I$\"&MATCH($R83,$A$15:$A$110,0)+15)+INDIRECT(\"$I$\"&MATCH($R83,$A$15:$A$110,0)+16)+INDIRECT(\"$I$\"&MATCH($R83,$A$15:$A$110,0)+17)","v":{"$error":"#N/A"}},{"$f":"INDIRECT(\"$O$\"&MATCH($R83,$A$15:$A$110,0)+14)+INDIRECT(\"$O$\"&MATCH($R83,$A$15:$A$110,0)+15)+INDIRECT(\"$O$\"&MATCH($R83,$A$15:$A$110,0)+16)+INDIRECT(\"$O$\"&MATCH($R83,$A$15:$A$110,0)+17)","v":{"$error":"#N/A"}},{"$f":"R83","v":"11:00 PM"}]
[]
[]
[]
[null,null,null,null,null,null,null,null,null,null,null,null,null,null,null,null,null,"12:00 AM",{"$f":"INDIRECT(\"$P$\"&MATCH($R87,$A$15:$A$110,0)+14)+INDIRECT(\"$P$\"&MATCH($R87,$A$15:$A$110,0)+15)+INDIRECT(\"$P$\"&MATCH($R87,$A$15:$A$110,0)+16)+INDIRECT(\"$P$\"&MATCH($R87,$A$15:$A$110,0)+17)+INDIRECT(\"$Q$\"&MATCH($R87,$A$15:$A$110,0)+14)+INDIRECT(\"$Q$\"&MATCH($R87,$A$15:$A$110,0)+15)+INDIRECT(\"$Q$\"&MATCH($R87,$A$15:$A$110,0)+16)+INDIRECT(\"$Q$\"&MATCH($R87,$A$15:$A$110,0)+17)","v":{"$error":"#N/A"}},{"$f":"INDIRECT(\"$G$\"&MATCH($R87,$A$15:$A$110,0)+14)+INDIRECT(\"$G$\"&MATCH($R87,$A$15:$A$110,0)+15)+INDIRECT(\"$G$\"&MATCH($R87,$A$15:$A$110,0)+16)+INDIRECT(\"$G$\"&MATCH($R87,$A$15:$A$110,0)+17)","v":{"$error":"#N/A"}},{"$f":"INDIRECT(\"$H$\"&MATCH($R87,$A$15:$A$110,0)+14)+INDIRECT(\"$H$\"&MATCH($R87,$A$15:$A$110,0)+15)+INDIRECT(\"$H$\"&MATCH($R87,$A$15:$A$110,0)+16)+INDIRECT(\"$H$\"&MATCH($R87,$A$15:$A$110,0)+17)+INDIRECT(\"$I$\"&MATCH($R87,$A$15:$A$110,0)+14)+INDIRECT(\"$I$\"&MATCH($R87,$A$15:$A$110,0)+15)+INDIRECT(\"$I$\"&MATCH($R87,$A$15:$A$110,0)+16)+INDIRECT(\"$I$\"&MATCH($R87,$A$15:$A$110,0)+17)","v":{"$error":"#N/A"}},{"$f":"INDIRECT(\"$O$\"&MATCH($R87,$A$15:$A$110,0)+14)+INDIRECT(\"$O$\"&MATCH($R87,$A$15:$A$110,0)+15)+INDIRECT(\"$O$\"&MATCH($R87,$A$15:$A$110,0)+16)+INDIRECT(\"$O$\"&MATCH($R87,$A$15:$A$110,0)+17)","v":{"$error":"#N/A"}},{"$f":"R87","v":"12:00 AM"}]
[]
[]
[]
[null,null,null,null,null,null,null,null,null,null,null,null,null,null,null,null,null,"1:00 AM",{"$f":"INDIRECT(\"$P$\"&MATCH($R91,$A$15:$A$110,0)+14)+INDIRECT(\"$P$\"&MATCH($R91,$A$15:$A$110,0)+15)+INDIRECT(\"$P$\"&MATCH($R91,$A$15:$A$110,0)+16)+INDIRECT(\"$P$\"&MATCH($R91,$A$15:$A$110,0)+17)+INDIRECT(\"$Q$\"&MATCH($R91,$A$15:$A$110,0)+14)+INDIRECT(\"$Q$\"&MATCH($R91,$A$15:$A$110,0)+15)+INDIRECT(\"$Q$\"&MATCH($R91,$A$15:$A$110,0)+16)+INDIRECT(\"$Q$\"&MATCH($R91,$A$15:$A$110,0)+17)","v":{"$error":"#N/A"}},{"$f":"INDIRECT(\"$G$\"&MATCH($R91,$A$15:$A$110,0)+14)+INDIRECT(\"$G$\"&MATCH($R91,$A$15:$A$110,0)+15)+INDIRECT(\"$G$\"&MATCH($R91,$A$15:$A$110,0)+16)+INDIRECT(\"$G$\"&MATCH($R91,$A$15:$A$110,0)+17)","v":{"$error":"#N/A"}},{"$f":"INDIRECT(\"$H$\"&MATCH($R91,$A$15:$A$110,0)+14)+INDIRECT(\"$H$\"&MATCH($R91,$A$15:$A$110,0)+15)+INDIRECT(\"$H$\"&MATCH($R91,$A$15:$A$110,0)+16)+INDIRECT(\"$H$\"&MATCH($R91,$A$15:$A$110,0)+17)+INDIRECT(\"$I$\"&MATCH($R91,$A$15:$A$110,0)+14)+INDIRECT(\"$I$\"&MATCH($R91,$A$15:$A$110,0)+15)+INDIRECT(\"$I$\"&MATCH($R91,$A$15:$A$110,0)+16)+INDIRECT(\"$I$\"&MATCH($R91,$A$15:$A$110,0)+17)","v":{"$error":"#N/A"}},{"$f":"INDIRECT(\"$O$\"&MATCH($R91,$A$15:$A$110,0)+14)+INDIRECT(\"$O$\"&MATCH($R91,$A$15:$A$110,0)+15)+INDIRECT(\"$O$\"&MATCH($R91,$A$15:$A$110,0)+16)+INDIRECT(\"$O$\"&MATCH($R91,$A$15:$A$110,0)+17)","v":{"$error":"#N/A"}},{"$f":"R91","v":"1:00 AM"}]
[]
[]
[]
[null,null,null,null,null,null,null,null,null,null,null,null,null,null,null,null,null,"2:00 AM",{"$f":"INDIRECT(\"$P$\"&MATCH($R95,$A$15:$A$110,0)+14)+INDIRECT(\"$P$\"&MATCH($R95,$A$15:$A$110,0)+15)+INDIRECT(\"$P$\"&MATCH($R95,$A$15:$A$110,0)+16)+INDIRECT(\"$P$\"&MATCH($R95,$A$15:$A$110,0)+17)+INDIRECT(\"$Q$\"&MATCH($R95,$A$15:$A$110,0)+14)+INDIRECT(\"$Q$\"&MATCH($R95,$A$15:$A$110,0)+15)+INDIRECT(\"$Q$\"&MATCH($R95,$A$15:$A$110,0)+16)+INDIRECT(\"$Q$\"&MATCH($R95,$A$15:$A$110,0)+17)","v":{"$error":"#N/A"}},{"$f":"INDIRECT(\"$G$\"&MATCH($R95,$A$15:$A$110,0)+14)+INDIRECT(\"$G$\"&MATCH($R95,$A$15:$A$110,0)+15)+INDIRECT(\"$G$\"&MATCH($R95,$A$15:$A$110,0)+16)+INDIRECT(\"$G$\"&MATCH($R95,$A$15:$A$110,0)+17)","v":{"$error":"#N/A"}},{"$f":"INDIRECT(\"$H$\"&MATCH($R95,$A$15:$A$110,0)+14)+INDIRECT(\"$H$\"&MATCH($R95,$A$15:$A$110,0)+15)+INDIRECT(\"$H$\"&MATCH($R95,$A$15:$A$110,0)+16)+INDIRECT(\"$H$\"&MATCH($R95,$A$15:$A$110,0)+17)+INDIRECT(\"$I$\"&MATCH($R95,$A$15:$A$110,0)+14)+INDIRECT(\"$I$\"&MATCH($R95,$A$15:$A$110,0)+15)+INDIRECT(\"$I$\"&MATCH($R95,$A$15:$A$110,0)+16)+INDIRECT(\"$I$\"&MATCH($R95,$A$15:$A$110,0)+17)","v":{"$error":"#N/A"}},{"$f":"INDIRECT(\"$O$\"&MATCH($R95,$A$15:$A$110,0)+14)+INDIRECT(\"$O$\"&MATCH($R95,$A$15:$A$110,0)+15)+INDIRECT(\"$O$\"&MATCH($R95,$A$15:$A$110,0)+16)+INDIRECT(\"$O$\"&MATCH($R95,$A$15:$A$110,0)+17)","v":{"$error":"#N/A"}},{"$f":"R95","v":"2:00 AM"}]
[]
[]
[]
[null,null,null,null,null,null,null,null,null,null,null,null,null,null,null,null,null,"3:00 AM",{"$f":"INDIRECT(\"$P$\"&MATCH($R99,$A$15:$A$110,0)+14)+INDIRECT(\"$P$\"&MATCH($R99,$A$15:$A$110,0)+15)+INDIRECT(\"$P$\"&MATCH($R99,$A$15:$A$110,0)+16)+INDIRECT(\"$P$\"&MATCH($R99,$A$15:$A$110,0)+17)+INDIRECT(\"$Q$\"&MATCH($R99,$A$15:$A$110,0)+14)+INDIRECT(\"$Q$\"&MATCH($R99,$A$15:$A$110,0)+15)+INDIRECT(\"$Q$\"&MATCH($R99,$A$15:$A$110,0)+16)+INDIRECT(\"$Q$\"&MATCH($R99,$A$15:$A$110,0)+17)","v":{"$error":"#N/A"}},{"$f":"INDIRECT(\"$G$\"&MATCH($R99,$A$15:$A$110,0)+14)+INDIRECT(\"$G$\"&MATCH($R99,$A$15:$A$110,0)+15)+INDIRECT(\"$G$\"&MATCH($R99,$A$15:$A$110,0)+16)+INDIRECT(\"$G$\"&MATCH($R99,$A$15:$A$110,0)+17)","v":{"$error":"#N/A"}},{"$f":"INDIRECT(\"$H$\"&MATCH($R99,$A$15:$A$110,0)+14)+INDIRECT(\"$H$\"&MATCH($R99,$A$15:$A$110,0)+15)+INDIRECT(\"$H$\"&MATCH($R99,$A$15:$A$110,0)+16)+INDIRECT(\"$H$\"&MATCH($R99,$A$15:$A$110,0)+17)+INDIRECT(\"$I$\"&MATCH($R99,$A$15:$A$110,0)+14)+INDIRECT(\"$I$\"&MATCH($R99,$A$15:$A$110,0)+15)+INDIRECT(\"$I$\"&MATCH($R99,$A$15:$A$110,0)+16)+INDIRECT(\"$I$\"&MATCH($R99,$A$15:$A$110,0)+17)","v":{"$error":"#N/A"}},{"$f":"INDIRECT(\"$O$\"&MATCH($R99,$A$15:$A$110,0)+14)+INDIRECT(\"$O$\"&MATCH($R99,$A$15:$A$110,0)+15)+INDIRECT(\"$O$\"&MATCH($R99,$A$15:$A$110,0)+16)+INDIRECT(\"$O$\"&MATCH($R99,$A$15:$A$110,0)+17)","v":{"$error":"#N/A"}},{"$f":"R99","v":"3:00 AM"}]
[]
[]
[]
[null,null,null,null,null,null,null,null,null,null,null,null,null,null,null,null,null,"4:00 AM",{"$f":"INDIRECT(\"$P$\"&MATCH($R103,$A$15:$A$110,0)+14)+INDIRECT(\"$P$\"&MATCH($R103,$A$15:$A$110,0)+15)+INDIRECT(\"$P$\"&MATCH($R103,$A$15:$A$110,0)+16)+INDIRECT(\"$P$\"&MATCH($R103,$A$15:$A$110,0)+17)+INDIRECT(\"$Q$\"&MATCH($R103,$A$15:$A$110,0)+14)+INDIRECT(\"$Q$\"&MATCH($R103,$A$15:$A$110,0)+15)+INDIRECT(\"$Q$\"&MATCH($R103,$A$15:$A$110,0)+16)+INDIRECT(\"$Q$\"&MATCH($R103,$A$15:$A$110,0)+17)","v":{"$error":"#N/A"}},{"$f":"INDIRECT(\"$G$\"&MATCH($R103,$A$15:$A$110,0)+14)+INDIRECT(\"$G$\"&MATCH($R103,$A$15:$A$110,0)+15)+INDIRECT(\"$G$\"&MATCH($R103,$A$15:$A$110,0)+16)+INDIRECT(\"$G$\"&MATCH($R103,$A$15:$A$110,0)+17)","v":{"$error":"#N/A"}},{"$f":"INDIRECT(\"$H$\"&MATCH($R103,$A$15:$A$110,0)+14)+INDIRECT(\"$H$\"&MATCH($R103,$A$15:$A$110,0)+15)+INDIRECT(\"$H$\"&MATCH($R103,$A$15:$A$110,0)+16)+INDIRECT(\"$H$\"&MATCH($R103,$A$15:$A$110,0)+17)+INDIRECT(\"$I$\"&MATCH($R103,$A$15:$A$110,0)+14)+INDIRECT(\"$I$\"&MATCH($R103,$A$15:$A$110,0)+15)+INDIRECT(\"$I$\"&MATCH($R103,$A$15:$A$110,0)+16)+INDIRECT(\"$I$\"&MATCH($R103,$A$15:$A$110,0)+17)","v":{"$error":"#N/A"}},{"$f":"INDIRECT(\"$O$\"&MATCH($R103,$A$15:$A$110,0)+14)+INDIRECT(\"$O$\"&MATCH($R103,$A$15:$A$110,0)+15)+INDIRECT(\"$O$\"&MATCH($R103,$A$15:$A$110,0)+16)+INDIRECT(\"$O$\"&MATCH($R103,$A$15:$A$110,0)+17)","v":{"$error":"#N/A"}},{"$f":"R103","v":"4:00 AM"}]
[]
[]
[]
[null,null,null,null,null,null,null,null,null,null,null,null,null,null,null,null,null,"5:00 AM",{"$f":"INDIRECT(\"$P$\"&MATCH($R107,$A$15:$A$110,0)+14)+INDIRECT(\"$P$\"&MATCH($R107,$A$15:$A$110,0)+15)+INDIRECT(\"$P$\"&MATCH($R107,$A$15:$A$110,0)+16)+INDIRECT(\"$P$\"&MATCH($R107,$A$15:$A$110,0)+17)+INDIRECT(\"$Q$\"&MATCH($R107,$A$15:$A$110,0)+14)+INDIRECT(\"$Q$\"&MATCH($R107,$A$15:$A$110,0)+15)+INDIRECT(\"$Q$\"&MATCH($R107,$A$15:$A$110,0)+16)+INDIRECT(\"$Q$\"&MATCH($R107,$A$15:$A$110,0)+17)","v":{"$error":"#N/A"}},{"$f":"INDIRECT(\"$G$\"&MATCH($R107,$A$15:$A$110,0)+14)+INDIRECT(\"$G$\"&MATCH($R107,$A$15:$A$110,0)+15)+INDIRECT(\"$G$\"&MATCH($R107,$A$15:$A$110,0)+16)+INDIRECT(\"$G$\"&MATCH($R107,$A$15:$A$110,0)+17)","v":{"$error":"#N/A"}},{"$f":"INDIRECT(\"$H$\"&MATCH($R107,$A$15:$A$110,0)+14)+INDIRECT(\"$H$\"&MATCH($R107,$A$15:$A$110,0)+15)+INDIRECT(\"$H$\"&MATCH($R107,$A$15:$A$110,0)+16)+INDIRECT(\"$H$\"&MATCH($R107,$A$15:$A$110,0)+17)+INDIRECT(\"$I$\"&MATCH($R107,$A$15:$A$110,0)+14)+INDIRECT(\"$I$\"&MATCH($R107,$A$15:$A$110,0)+15)+INDIRECT(\"$I$\"&MATCH($R107,$A$15:$A$110,0)+16)+INDIRECT(\"$I$\"&MATCH($R107,$A$15:$A$110,0)+17)","v":{"$error":"#N/A"}},{"$f":"INDIRECT(\"$O$\"&MATCH($R107,$A$15:$A$110,0)+14)+INDIRECT(\"$O$\"&MATCH($R107,$A$15:$A$110,0)+15)+INDIRECT(\"$O$\"&MATCH($R107,$A$15:$A$110,0)+16)+INDIRECT(\"$O$\"&MATCH($R107,$A$15:$A$110,0)+17)","v":{"$error":"#N/A"}},{"$f":"R107","v":"5:00 AM"}]

{"sheet":"E-W Formatted","index":10,"n_rows":0,"n_cols":0,"rows_kept":0,"cut":false,"hidden":false,"merged":[]}

{"sheet":"Calcs","index":11,"n_rows":5,"n_cols":2,"rows_kept":5,"cut":false,"hidden":false,"merged":[]}
["Sight Distance (ft)"]
["Speed Limit (mph)"]
["Sight Dist. (travel time, s)",{"$f":"B1/B2*3600/5280","v":{"$error":"#DIV/0!"}}]
[]
["Cross Product",{"$f":"A4*B4","v":0}]

{"sheet":"Lists","index":12,"n_rows":6,"n_cols":5,"rows_kept":6,"cut":false,"hidden":false,"merged":[]}
["NB-SB","EB-WB","Phasing","TOD Plan","Risk"]
["NB-WB Left","EB-NB Left","Protected Only","AM","Low"]
["SB-EB Left","WB-SB Left","Prot-Perm","Mid-Day","Normal"]
[null,null,"Permissive Only","PM","Elevated"]
[null,null,null,"Evening","N/A"]
[null,null,null,"Free"]